{"text_format":"3","workbook":"xlsx","n_sheets":2,"sheets":["Tabelle1","Übersetzung"],"not_rendered":{"images":4,"defined_names":1},"read":"whole","date_system":"1900"}

{"sheet":"Tabelle1","index":0,"n_rows":13,"n_cols":7,"rows_kept":13,"merged":[[0,0,0,6],[3,1,4,6],[5,0,5,6],[6,0,6,6],[7,1,7,2],[7,3,8,4],[7,5,8,5],[7,6,10,6],[8,1,8,2],[9,2,10,4],[9,5,10,5],[11,0,11,6],[12,0,12,6]]}
[{"$f":"VLOOKUP(G2,Übersetzung!A1:B4,2,FALSE)","v":"Marking for sample parts"}]
[{"$nulls":5},1,{"$f":"IF(F2=2,\"Bosanski\",IF(F2=3,\"Česky\",\"English\"))","v":"English"}]
[]
["Lieferant:"]
[{"$f":"VLOOKUP(G2,Übersetzung!A1:C4,3,FALSE)","v":"Supplier:"}]
["MUSTERTEILE"]
[{"$f":"VLOOKUP(G2,Übersetzung!A1:D4,4,FALSE)","v":"SAMPLE PARTS"}]
["ACHTUNG!","BENEDICT Artikelnr.:",{"$nulls":3},"BENEDICT Änderungsindex.:"]
[{"$f":"VLOOKUP(G2,Übersetzung!A1:E4,5,FALSE)","v":"ATTENTION!"},{"$f":"VLOOKUP(G2,Übersetzung!A2:G5,7,FALSE)","v":"BENEDICT part no.:"}]
[null,"Datum:",{"$nulls":3},{"$f":"VLOOKUP(G2,Übersetzung!A2:F5,6,FALSE)","v":"BENEDICT Change index.:"}]
[null,{"$f":"VLOOKUP(G2,Übersetzung!A2:H5,8,FALSE)","v":"Date:"}]
["Achtung: Jede Verpackungseinheit ist zu kennzeichnen."]
[{"$f":"VLOOKUP(G2,Übersetzung!A2:I5,9,FALSE)","v":"Attention: Each packaging unit must be marked"}]

{"sheet":"Übersetzung","index":1,"n_rows":4,"n_cols":9,"rows_kept":4,"hidden":true}
["Deutsch","Kennzeichnung für Musterteile","Lieferant:","MUSTERTEILE","ACHTUNG!","BENEDICT Änderungs Index.:","BENEDICT Artikelnr.:","Datum:","Achtung: Jede Verpackungseinheit ist zu kennzeichnen"]
["English","Marking for sample parts","Supplier:","SAMPLE PARTS","ATTENTION!","BENEDICT Change index.:","BENEDICT part no.:","Date:","Attention: Each packaging unit must be marked"]
["Česky","Označování dílů vzorků","Dodavatel:","VZOROVÉ DÍLY","POZOR!","BENEDICT index změny.:","BENEDICT číslo produktu:","Datum:","Upozornění: Každá obalová jednotka musí být označena štítkem."]
["Bosanski","Označavanje uzoraka dijelova"," Dostavjlac:","UZORAK DELOVA","OPASNOST!","BENEDICT Indeks izmijena.:","BENEDICT sifra:","Datum:","Pažnja: Svaka jedinica pakovanja mora biti označena"]