{"text_format":"3","workbook":"xlsx","n_sheets":5,"sheets":["Messergebnisse","Fähigkeitsnachweis","Histogramm","Normalverteilung","Umstellung"],"not_rendered":{"charts":5,"images":2,"macros":1,"defined_names":7},"read":"whole","date_system":"1900"}

{"sheet":"Messergebnisse","index":0,"n_rows":55,"n_cols":7,"rows_kept":55,"merged":[[0,0,0,7]]}
["Messergebnisse / Measurement results"]
[1,null,55,null,109,null,163]
[2,null,56,null,110,null,164]
[3,null,57,null,111,null,165]
[4,null,58,null,112,null,166]
[5,null,59,null,113,null,167]
[6,null,60,null,114,null,168]
[7,null,61,null,115,null,169]
[8,null,62,null,116,null,170]
[9,null,63,null,117,null,171]
[10,null,64,null,118,null,172]
[11,null,65,null,119,null,173]
[12,null,66,null,120,null,174]
[13,null,67,null,121,null,175]
[14,null,68,null,122,null,176]
[15,null,69,null,123,null,177]
[16,null,70,null,124,null,178]
[17,null,71,null,125,null,179]
[18,null,72,null,126,null,180]
[19,null,73,null,127,null,181]
[20,null,74,null,128,null,182]
[21,null,75,null,129,null,183]
[22,null,76,null,130,null,184]
[23,null,77,null,131,null,185]
[24,null,78,null,132,null,186]
[25,null,79,null,133,null,187]
[26,null,80,null,134,null,188]
[27,null,81,null,135,null,189]
[28,null,82,null,136,null,190]
[29,null,83,null,137,null,191]
[30,null,84,null,138,null,192]
[31,null,85,null,139,null,193]
[32,null,86,null,140,null,194]
[33,null,87,null,141,null,195]
[34,null,88,null,142,null,196]
[35,null,89,null,143,null,197]
[36,null,90,null,144,null,198]
[37,null,91,null,145,null,199]
[38,null,92,null,146,null,200]
[39,null,93,null,147,null,201]
{"$rows_left_out":16}
{"sheet":"Fähigkeitsnachweis","index":1,"n_rows":94,"n_cols":7,"rows_kept":94,"merged":[[1,1,2,3],[1,5,2,7],[3,1,4,3],[3,5,4,7],[5,0,5,1],[5,2,6,3],[5,5,6,7],[9,1,10,3],[11,1,12,3],[11,4,11,5],[11,6,12,7],[12,4,12,5],[13,0,13,1],[13,2,14,3],[13,4,13,5],[13,6,14,7],[14,0,14,1],[14,4,14,5],[16,0,16,7],[17,0,18,0],[17,1,18,1],[17,2,17,3],[18,2,18,3],[19,0,20,0],[19,1,20,1],[19,2,19,3],[20,2,20,3],[21,0,22,0],[21,1,22,1],[21,2,21,3],[22,2,22,3],[23,0,23,7],[24,0,24,1],[24,2,25,3],[24,4,24,5],[24,6,25,7],[25,0,25,1],[25,4,25,5],[26,0,26,1],[26,2,27,3],[26,4,26,5],[26,6,27,7],[27,0,27,1],[27,4,27,5],[28,0,28,1],[28,2,29,3],[28,4,28,5],[28,6,29,7],[29,0,29,1],[29,4,29,5],[30,0,30,1],[30,2,31,3],[30,4,30,5],[30,6,31,7],[31,0,31,1],[31,4,31,5],[32,0,33,1],[32,2,35,3],[34,0,35,1],[38,0,39,0],[38,1,39,2],[40,0,41,0],[40,1,41,2],[42,0,43,0],[42,1,43,2],[44,0,45,0],[44,1,45,2],[46,1,46,2],[47,1,47,2],[93,0,93,4]]}
["Stammdaten / Base data"]
["Artikelnnr.:",{"$nulls":3},"Prüfer:"]
["Part no.:",{"$nulls":3},"Inspector:"]
["Artikelbez.:",{"$nulls":3},"Datum:"]
["part descrip.:",{"$nulls":3},"Date:"]
["Zeichnungsnr. + Index:",{"$nulls":3},"Merkmal:"]
["Drawing No. + index.:",{"$nulls":3},"Characteristic:"]
[]
["Messangaben / Measurement details"]
["Messmittel:"]
["Measuring tools:"]
["Sollwert =",{"$nulls":3},"Maßeinheit:"]
["Target value =",{"$nulls":3},"Unit of measurement:"]
["Unter Grenzwert (UGW) =",{"$nulls":3},"Oberer Grenzwert (OGW) ="]
["Under limit value =",{"$nulls":3},"Upper limit value ="]
[null,null,1,{"$f":"IF(C16=2,\"Prozessleistungsindex\",IF(C16=3,\"Prozessfähigkeitsindex\",\"Maschinenfähigkeitsindex\"))","v":"Maschinenfähigkeitsindex"}]
["Berechnungswerte / calculation values"]
[{"$f":"VLOOKUP(D16,Umstellung!A1:D3,3,FALSE)","v":"Cmk<"},{"$f":"VLOOKUP(D16,Umstellung!A7:C9,3,FALSE)","v":1.33},"Prozess nicht fähig"]
[null,null,"Process not capable"]
[{"$f":"VLOOKUP(D16,Umstellung!A1:D3,2,FALSE)","v":"Cmk"},"zwischen","Prozess bedingt fähig"]
[null,null,"Process conditionally capable"]
[{"$f":"VLOOKUP(D16,Umstellung!A1:D3,4,FALSE)","v":"Cmk>"},{"$f":"VLOOKUP(D16,Umstellung!A7:C9,2,FALSE)","v":1.5},"Prozess fähig"]
[null,null,"Process capable"]
["Auswertung / Evaluation"]
["Anzahl Klassen Histogramm:",null,{"$f":"SQRT(C27)","v":0},null,"Median",null,{"$f":"IF(Messergebnisse!B2=\"\",\"\",MEDIAN(Messergebnisse!B2:B55,Messergebnisse!D2:D55,Messergebnisse!F2:F55,Messergebnisse!H2:H55))","v":""}]
["Nr. of classes histogram:",{"$nulls":3},"Median"]
["Umfang der Stichprobe:",null,{"$f":"COUNT(Messergebnisse!B2:B55,Messergebnisse!D2:D55,Messergebnisse!F2:F55,Messergebnisse!H2:H55)","v":0},null,"Spannweite R",null,{"$f":"G31-G29","v":0}]
["Sample size:",{"$nulls":3},"Range R"]
["Mittelwert µ:",null,{"$f":"IF(Messergebnisse!B2=\"\",\"\",AVERAGE(Messergebnisse!B2:B55,Messergebnisse!D2:D55,Messergebnisse!F2:F55,Messergebnisse!H2:H55))","v":""},null,"Minimum",null,{"$f":"MIN(Messergebnisse!B2:B55,Messergebnisse!D2:D55,Messergebnisse!F2:F55,Messergebnisse!H2:H55)","v":0}]
["Mean value:",{"$nulls":3},"Minimum"]
["Standardabweichung σ:",null,{"$f":"IF(Messergebnisse!B2=\"\",\"\",STDEV(Messergebnisse!B2:B55,Messergebnisse!D2:D55,Messergebnisse!F2:F55,Messergebnisse!H2:H55))","v":""},null,"Maximum",null,{"$f":"MAX(Messergebnisse!B2:B55,Messergebnisse!D2:D55,Messergebnisse!F2:F55,Messergebnisse!H2:H55)","v":0}]
["Standard deviation:",{"$nulls":3},"Maximum"]
["Die Werte sind nach \nAndersson Darling Test",null,{"$f":"IF(C31=\"\",\"\",IF(Normalverteilung!K5<0.05,\"nicht normalverteilt\",\"normalverteilt\"))","v":""}]
[]
["The values are after\nAndersson Darling test"]
[]
[]
["Fähigkeitswerte / Capability values"]
[{"$f":"VLOOKUP(D16,Umstellung!A1:F3,5,FALSE)","v":"Cmku"},{"$f":"IF(C29=\"\",\"\",(C29-C14)/(3*C31))","v":""}]
[]
{"$rows_left_out":15}
{"sheet":"Histogramm","index":2,"n_rows":226,"n_cols":17,"rows_kept":226,"hidden":true,"merged":[[9,11,9,16]]}
["Umfang Stichprobe",{"$f":"Fähigkeitsnachweis!C27","v":0}]
["Mittelwert",{"$f":"Fähigkeitsnachweis!C29","v":""}]
["Standartabweichung",{"$f":"Fähigkeitsnachweis!C31","v":""}]
["Range der einzelnen Histogrammanzeigen",{"$f":"Fähigkeitsnachweis!G27/Fähigkeitsnachweis!C25","v":{"$error":"#DIV/0!"}}]
["Minimum Wert",{"$f":"Fähigkeitsnachweis!G29","v":0}]
["Maximum Wert",{"$f":"Fähigkeitsnachweis!G31","v":0}]
["Klassenanzahl",{"$f":"Fähigkeitsnachweis!C25","v":{"v":0,"d":"0.00"}}]
["Ganze zahl der Klassenanzahl",{"$f":"INT(B7)","v":0}]
[]
["Histogrammklasse","von ","bis","von (2 Dezimalen)","bis (2 Dezimalen)","Wie oft liegen Messwerte zwischen von bis","Zähler Messergebnisse","xi sortiert",null,"Max Wert Histogramm Kurve",null,"Diagramm Histogramm"]
[1,{"$f":"B5","v":{"v":0,"d":"0.00"}},{"$f":"IF(A11=$B$8,$B$6,IF($B$7>=A12,SUM(B11+$B$4),#N/A))","v":{"$error":"#N/A"}},{"$f":"IF(B11=\"\",\"\",FIXED(B11,2))","v":"0,00"},{"$f":"IF(C11=\"\",#N/A,FIXED(C11,2))","v":{"$error":"#N/A"}},{"$f":"IF(C11=\"\",\"\",COUNTIFS(Normalverteilung!$C$9:$C$224,\">=\"&B11,Normalverteilung!$C$9:$C$224,\"<=\"&C11))","v":{"$error":"#N/A"}},1,{"$f":"IF(Normalverteilung!E9=\"#NV\",\"\",Normalverteilung!E9)","v":{"$error":"#N/A"}},{"$f":"_xlfn.NORM.DIST(H11,$B$2,$B$3,FALSE)*$B$1","v":{"$error":"#N/A"}},{"$f":"MAX(IF(ISERROR(I11:I226),,I11:I226))","v":0},null," Mittelwert",null,"UGW","OGW","- 3 Sigma","+ 3 Sigma"]
[2,{"$f":"IF(A12=(SUM($B$8+1)),#N/A,IF(C11=\"\",#N/A,C11+0.01))","v":{"$error":"#N/A"}},{"$f":"IF(A12=$B$8,$B$6,IF($B$7>=A13,SUM(B12+$B$4),#N/A))","v":{"$error":"#N/A"}},{"$f":"IF(B12=\"\",\"\",FIXED(B12,2))","v":{"$error":"#N/A"}},{"$error":"#N/A"},{"$f":"IF(C12=\"\",\"\",COUNTIFS(Normalverteilung!$C$9:$C$224,\">=\"&B12,Normalverteilung!$C$9:$C$224,\"<=\"&C12))","v":{"$error":"#N/A"}},2,{"$f":"IF(Normalverteilung!E10=\"#NV\",\"\",Normalverteilung!E10)","v":{"$error":"#N/A"}},{"$f":"_xlfn.NORM.DIST(H12,$B$2,$B$3,FALSE)*$B$1","v":{"$error":"#N/A"}},null,null,"Wert x","Wert y","Wert x","Wert x","Wert x","Wert x"]
[3,{"$error":"#N/A"},{"$error":"#N/A"},{"$error":"#N/A"},{"$error":"#N/A"},{"$f":"IF(C13=\"\",\"\",COUNTIFS(Normalverteilung!$C$9:$C$224,\">=\"&B13,Normalverteilung!$C$9:$C$224,\"<=\"&C13))","v":{"$error":"#N/A"}},3,{"$f":"IF(Normalverteilung!E11=\"#NV\",\"\",Normalverteilung!E11)","v":{"$error":"#N/A"}},{"$error":"#N/A"},null,null,{"$f":"Normalverteilung!$E$3","v":""},0,{"$f":"Fähigkeitsnachweis!$C$14","v":0},{"$f":"Fähigkeitsnachweis!$G$14","v":0},{"$f":"Fähigkeitsnachweis!$C$29-(3*Fähigkeitsnachweis!$C$31)","v":{"$error":"#VALUE!"}},{"$f":"Fähigkeitsnachweis!$C$29+(3*Fähigkeitsnachweis!$C$31)","v":{"$error":"#VALUE!"}}]
[4,{"$error":"#N/A"},{"$error":"#N/A"},{"$error":"#N/A"},{"$error":"#N/A"},{"$f":"IF(C14=\"\",\"\",COUNTIFS(Normalverteilung!$C$9:$C$224,\">=\"&B14,Normalverteilung!$C$9:$C$224,\"<=\"&C14))","v":{"$error":"#N/A"}},4,{"$f":"IF(Normalverteilung!E12=\"#NV\",\"\",Normalverteilung!E12)","v":{"$error":"#N/A"}},{"$error":"#N/A"},null,null,{"$f":"Normalverteilung!$E$3","v":""},{"$f":"J11","v":0},{"$f":"Fähigkeitsnachweis!$C$14","v":0},{"$f":"Fähigkeitsnachweis!$G$14","v":0},{"$f":"Fähigkeitsnachweis!$C$29-(3*Fähigkeitsnachweis!$C$31)","v":{"$error":"#VALUE!"}},{"$f":"Fähigkeitsnachweis!$C$29+(3*Fähigkeitsnachweis!$C$31)","v":{"$error":"#VALUE!"}}]
[5,{"$error":"#N/A"},{"$error":"#N/A"},{"$error":"#N/A"},{"$error":"#N/A"},{"$f":"IF(C15=\"\",\"\",COUNTIFS(Normalverteilung!$C$9:$C$224,\">=\"&B15,Normalverteilung!$C$9:$C$224,\"<=\"&C15))","v":{"$error":"#N/A"}},5,{"$f":"IF(Normalverteilung!E13=\"#NV\",\"\",Normalverteilung!E13)","v":{"$error":"#N/A"}},{"$error":"#N/A"}]
[6,{"$error":"#N/A"},{"$error":"#N/A"},{"$error":"#N/A"},{"$error":"#N/A"},{"$f":"IF(C16=\"\",\"\",COUNTIFS(Normalverteilung!$C$9:$C$224,\">=\"&B16,Normalverteilung!$C$9:$C$224,\"<=\"&C16))","v":{"$error":"#N/A"}},6,{"$f":"IF(Normalverteilung!E14=\"#NV\",\"\",Normalverteilung!E14)","v":{"$error":"#N/A"}},{"$error":"#N/A"}]
[7,{"$error":"#N/A"},{"$error":"#N/A"},{"$error":"#N/A"},{"$error":"#N/A"},{"$f":"IF(C17=\"\",\"\",COUNTIFS(Normalverteilung!$C$9:$C$224,\">=\"&B17,Normalverteilung!$C$9:$C$224,\"<=\"&C17))","v":{"$error":"#N/A"}},7,{"$f":"IF(Normalverteilung!E15=\"#NV\",\"\",Normalverteilung!E15)","v":{"$error":"#N/A"}},{"$error":"#N/A"}]
[8,{"$error":"#N/A"},{"$error":"#N/A"},{"$error":"#N/A"},{"$error":"#N/A"},{"$f":"IF(C18=\"\",\"\",COUNTIFS(Normalverteilung!$C$9:$C$224,\">=\"&B18,Normalverteilung!$C$9:$C$224,\"<=\"&C18))","v":{"$error":"#N/A"}},8,{"$f":"IF(Normalverteilung!E16=\"#NV\",\"\",Normalverteilung!E16)","v":{"$error":"#N/A"}},{"$error":"#N/A"}]
[9,{"$error":"#N/A"},{"$error":"#N/A"},{"$error":"#N/A"},{"$error":"#N/A"},{"$f":"IF(C19=\"\",\"\",COUNTIFS(Normalverteilung!$C$9:$C$224,\">=\"&B19,Normalverteilung!$C$9:$C$224,\"<=\"&C19))","v":{"$error":"#N/A"}},9,{"$f":"IF(Normalverteilung!E17=\"#NV\",\"\",Normalverteilung!E17)","v":{"$error":"#N/A"}},{"$error":"#N/A"}]
[10,{"$error":"#N/A"},{"$error":"#N/A"},{"$error":"#N/A"},{"$error":"#N/A"},{"$f":"IF(C20=\"\",\"\",COUNTIFS(Normalverteilung!$C$9:$C$224,\">=\"&B20,Normalverteilung!$C$9:$C$224,\"<=\"&C20))","v":{"$error":"#N/A"}},10,{"$f":"IF(Normalverteilung!E18=\"#NV\",\"\",Normalverteilung!E18)","v":{"$error":"#N/A"}},{"$error":"#N/A"}]
[11,{"$f":"IF(A21=(SUM($B$8+1)),#N/A,IF(C20=\"\",#N/A,C20+0.01))","v":{"$error":"#N/A"}},{"$error":"#N/A"},{"$error":"#N/A"},{"$f":"IF(C21=\"\",#N/A,FIXED(C21,2))","v":{"$error":"#N/A"}},{"$f":"IF(C21=\"\",\"#NV\",COUNTIFS(Normalverteilung!$C$9:$C$224,\">=\"&B21,Normalverteilung!$C$9:$C$224,\"<=\"&C21))","v":{"$error":"#N/A"}},11,{"$f":"IF(Normalverteilung!E19=\"#NV\",\"\",Normalverteilung!E19)","v":{"$error":"#N/A"}},{"$error":"#N/A"}]
[12,{"$f":"IF(A22=(SUM($B$8+1)),#N/A,IF(C21=\"\",#N/A,C21+0.01))","v":{"$error":"#N/A"}},{"$error":"#N/A"},{"$error":"#N/A"},{"$f":"IF(C22=\"\",#N/A,FIXED(C22,2))","v":{"$error":"#N/A"}},{"$f":"IF(C22=\"\",\"#NV\",COUNTIFS(Normalverteilung!$C$9:$C$224,\">=\"&B22,Normalverteilung!$C$9:$C$224,\"<=\"&C22))","v":{"$error":"#N/A"}},12,{"$f":"IF(Normalverteilung!E20=\"#NV\",\"\",Normalverteilung!E20)","v":{"$error":"#N/A"}},{"$error":"#N/A"}]
[13,{"$error":"#N/A"},{"$error":"#N/A"},{"$error":"#N/A"},{"$error":"#N/A"},{"$f":"IF(C23=\"\",\"#NV\",COUNTIFS(Normalverteilung!$C$9:$C$224,\">=\"&B23,Normalverteilung!$C$9:$C$224,\"<=\"&C23))","v":{"$error":"#N/A"}},13,{"$f":"IF(Normalverteilung!E21=\"#NV\",\"\",Normalverteilung!E21)","v":{"$error":"#N/A"}},{"$error":"#N/A"}]
[14,{"$error":"#N/A"},{"$error":"#N/A"},{"$error":"#N/A"},{"$error":"#N/A"},{"$f":"IF(C24=\"\",\"#NV\",COUNTIFS(Normalverteilung!$C$9:$C$224,\">=\"&B24,Normalverteilung!$C$9:$C$224,\"<=\"&C24))","v":{"$error":"#N/A"}},14,{"$f":"IF(Normalverteilung!E22=\"#NV\",\"\",Normalverteilung!E22)","v":{"$error":"#N/A"}},{"$error":"#N/A"}]
[15,{"$error":"#N/A"},{"$error":"#N/A"},{"$error":"#N/A"},{"$error":"#N/A"},{"$f":"IF(C25=\"\",\"#NV\",COUNTIFS(Normalverteilung!$C$9:$C$224,\">=\"&B25,Normalverteilung!$C$9:$C$224,\"<=\"&C25))","v":{"$error":"#N/A"}},15,{"$f":"IF(Normalverteilung!E23=\"#NV\",\"\",Normalverteilung!E23)","v":{"$error":"#N/A"}},{"$error":"#N/A"}]
[16,{"$error":"#N/A"},{"$error":"#N/A"},{"$error":"#N/A"},{"$error":"#N/A"},{"$f":"IF(C26=\"\",\"#NV\",COUNTIFS(Normalverteilung!$C$9:$C$224,\">=\"&B26,Normalverteilung!$C$9:$C$224,\"<=\"&C26))","v":{"$error":"#N/A"}},16,{"$f":"IF(Normalverteilung!E24=\"#NV\",\"\",Normalverteilung!E24)","v":{"$error":"#N/A"}},{"$error":"#N/A"}]
[17,{"$error":"#N/A"},{"$error":"#N/A"},{"$error":"#N/A"},{"$error":"#N/A"},{"$f":"IF(C27=\"\",\"#NV\",COUNTIFS(Normalverteilung!$C$9:$C$224,\">=\"&B27,Normalverteilung!$C$9:$C$224,\"<=\"&C27))","v":{"$error":"#N/A"}},17,{"$f":"IF(Normalverteilung!E25=\"#NV\",\"\",Normalverteilung!E25)","v":{"$error":"#N/A"}},{"$error":"#N/A"}]
[18,{"$error":"#N/A"},{"$error":"#N/A"},{"$error":"#N/A"},{"$error":"#N/A"},{"$f":"IF(C28=\"\",\"#NV\",COUNTIFS(Normalverteilung!$C$9:$C$224,\">=\"&B28,Normalverteilung!$C$9:$C$224,\"<=\"&C28))","v":{"$error":"#N/A"}},18,{"$f":"IF(Normalverteilung!E26=\"#NV\",\"\",Normalverteilung!E26)","v":{"$error":"#N/A"}},{"$error":"#N/A"}]
[19,{"$error":"#N/A"},{"$error":"#N/A"},{"$error":"#N/A"},{"$error":"#N/A"},{"$f":"IF(C29=\"\",\"#NV\",COUNTIFS(Normalverteilung!$C$9:$C$224,\">=\"&B29,Normalverteilung!$C$9:$C$224,\"<=\"&C29))","v":{"$error":"#N/A"}},19,{"$f":"IF(Normalverteilung!E27=\"#NV\",\"\",Normalverteilung!E27)","v":{"$error":"#N/A"}},{"$error":"#N/A"}]
[20,{"$error":"#N/A"},{"$error":"#N/A"},{"$error":"#N/A"},{"$error":"#N/A"},{"$f":"IF(C30=\"\",\"#NV\",COUNTIFS(Normalverteilung!$C$9:$C$224,\">=\"&B30,Normalverteilung!$C$9:$C$224,\"<=\"&C30))","v":{"$error":"#N/A"}},20,{"$f":"IF(Normalverteilung!E28=\"#NV\",\"\",Normalverteilung!E28)","v":{"$error":"#N/A"}},{"$error":"#N/A"}]
[21,{"$error":"#N/A"},{"$error":"#N/A"},{"$error":"#N/A"},{"$error":"#N/A"},{"$f":"IF(C31=\"\",\"#NV\",COUNTIFS(Normalverteilung!$C$9:$C$224,\">=\"&B31,Normalverteilung!$C$9:$C$224,\"<=\"&C31))","v":{"$error":"#N/A"}},21,{"$f":"IF(Normalverteilung!E29=\"#NV\",\"\",Normalverteilung!E29)","v":{"$error":"#N/A"}},{"$error":"#N/A"}]
[22,{"$error":"#N/A"},{"$error":"#N/A"},{"$error":"#N/A"},{"$error":"#N/A"},{"$f":"IF(C32=\"\",\"#NV\",COUNTIFS(Normalverteilung!$C$9:$C$224,\">=\"&B32,Normalverteilung!$C$9:$C$224,\"<=\"&C32))","v":{"$error":"#N/A"}},22,{"$f":"IF(Normalverteilung!E30=\"#NV\",\"\",Normalverteilung!E30)","v":{"$error":"#N/A"}},{"$error":"#N/A"}]
[23,{"$error":"#N/A"},{"$error":"#N/A"},{"$error":"#N/A"},{"$error":"#N/A"},{"$f":"IF(C33=\"\",\"#NV\",COUNTIFS(Normalverteilung!$C$9:$C$224,\">=\"&B33,Normalverteilung!$C$9:$C$224,\"<=\"&C33))","v":{"$error":"#N/A"}},23,{"$f":"IF(Normalverteilung!E31=\"#NV\",\"\",Normalverteilung!E31)","v":{"$error":"#N/A"}},{"$error":"#N/A"}]
[24,{"$error":"#N/A"},{"$error":"#N/A"},{"$error":"#N/A"},{"$error":"#N/A"},{"$f":"IF(C34=\"\",\"#NV\",COUNTIFS(Normalverteilung!$C$9:$C$224,\">=\"&B34,Normalverteilung!$C$9:$C$224,\"<=\"&C34))","v":{"$error":"#N/A"}},24,{"$f":"IF(Normalverteilung!E32=\"#NV\",\"\",Normalverteilung!E32)","v":{"$error":"#N/A"}},{"$error":"#N/A"}]
[25,{"$error":"#N/A"},{"$f":"IF(B35<>#N/A,B6,#N/A)","v":{"$error":"#N/A"}},{"$error":"#N/A"},{"$error":"#N/A"},{"$f":"IF(C35=\"\",\"#NV\",COUNTIFS(Normalverteilung!$C$9:$C$224,\">=\"&B35,Normalverteilung!$C$9:$C$224,\"<=\"&C35))","v":{"$error":"#N/A"}},25,{"$f":"IF(Normalverteilung!E33=\"#NV\",\"\",Normalverteilung!E33)","v":{"$error":"#N/A"}},{"$error":"#N/A"}]
[{"$nulls":6},26,{"$f":"IF(Normalverteilung!E34=\"#NV\",\"\",Normalverteilung!E34)","v":{"$error":"#N/A"}},{"$error":"#N/A"}]
[{"$nulls":6},27,{"$f":"IF(Normalverteilung!E35=\"#NV\",\"\",Normalverteilung!E35)","v":{"$error":"#N/A"}},{"$error":"#N/A"}]
[{"$nulls":6},28,{"$f":"IF(Normalverteilung!E36=\"#NV\",\"\",Normalverteilung!E36)","v":{"$error":"#N/A"}},{"$error":"#N/A"}]
[{"$nulls":6},29,{"$f":"IF(Normalverteilung!E37=\"#NV\",\"\",Normalverteilung!E37)","v":{"$error":"#N/A"}},{"$error":"#N/A"}]
[{"$nulls":6},30,{"$f":"IF(Normalverteilung!E38=\"#NV\",\"\",Normalverteilung!E38)","v":{"$error":"#N/A"}},{"$error":"#N/A"}]
{"$rows_left_out":187}
{"sheet":"Normalverteilung","index":3,"n_rows":224,"n_cols":22,"rows_kept":224,"hidden":true,"merged":[[1,1,1,2],[2,1,2,2],[3,1,3,2],[4,1,4,2],[5,1,5,2],[5,16,5,21]]}
[]
[null,"Anzahl",null,null,{"$f":"Fähigkeitsnachweis!C27","v":0},null,"p1",{"$f":"IF((K4>=0.6),EXP(1.2937-5.709*K4+0.0186*K4^ 2),0)","v":{"$error":"#N/A"}},null,"S",{"$f":"SUM(J9:J224)","v":{"$error":"#N/A"}}]
[null,"Mittelwert",null,null,{"$f":"Fähigkeitsnachweis!C29","v":""},null,"p2",{"$f":"IF(AND(K4<0.6,K4>=0.34),EXP(0.9177-4.279*K4-1.38*K4^2),0)","v":{"$error":"#N/A"}},null,"AD",{"$f":"-K2/E2-E2","v":{"$error":"#N/A"}}]
[null,"Standartabweichung",null,null,{"$f":"Fähigkeitsnachweis!C31","v":""},null,"p3",{"$f":"IF(AND(K4<0.34,K4>=0.2),1-EXP(-8.318+42.796*K4-59.938*K4^2),0)","v":{"$error":"#N/A"}},null,"z",{"$f":"K3*(1+0.75/E2+2.25/E2^2)","v":{"$error":"#N/A"}}]
[null,"Minumum",null,null,{"$f":"MIN(C9:C224)","v":{"$error":"#N/A"}},null,"p4",{"$f":"IF(K4<0.2,1-EXP(-13.436+101.14*K4-223.73*K4^2),0)","v":{"$error":"#N/A"}},null,"p - Wert",{"$f":"MAX(H2:H5)","v":{"$error":"#N/A"}}]
[null,"Maximum",null,null,{"$f":"MAX(C9:C224)","v":{"$error":"#N/A"}},{"$nulls":11},"Diagramm Chronologische Stochprobe"]
[{"$nulls":16}," Mittelwert",null,"UGW","OGW","- 3 Sigma","+ 3 Sigma"]
["Zähler","Zähler mit leer","xi","xi mit #NV","xi sortiert","Zähler","A","B","C","S","z",null,null,"Wert","z",null,"Wert y","Wert x","Wert y ","Wert y","Wert y","Wert y"]
[1,{"$f":"_xlfn.IFNA(IF(C9=\"\",#N/A,A9),\"\")","v":""},{"$f":"IF(Messergebnisse!B2=\"\",#N/A,Messergebnisse!B2)","v":{"$error":"#N/A"}},{"$f":"IF(C9=\"\",#N/A,C9)","v":{"$error":"#N/A"}},{"$f":"IF(C9=\"\",#N/A,SMALL(C$9:C$224,F9))","v":{"$error":"#N/A"}},{"$f":"IF(C9=\"\",\"\",1)","v":{"$error":"#N/A"}},{"$f":"IF(IF(C9=\"\",\"\",NORMSDIST((E9-$E$3)/$E$4))=1,0.999999999,IF(C9=\"\",\"\",NORMSDIST((E9-$E$3)/$E$4)))","v":{"$error":"#N/A"}},{"$f":"IF(C9=\"\",\"\",1-G9)","v":{"$error":"#N/A"}},{"$f":"IF(C9=\"\",\"\",SMALL(H$9:H$224,F9))","v":{"$error":"#N/A"}},{"$f":"IF(C9=\"\",\"\",(2*F9-1)*(LN(I9)+LN(G9)))","v":{"$error":"#N/A"}},{"$f":"IF(C9=\"\",#N/A,NORMSINV((F9-0.3)/($E$2+0.4)))","v":{"$error":"#N/A"}},null,null,{"$f":"O9*E4+E3","v":{"$error":"#VALUE!"}},-3,null,{"$f":"$E$3","v":""},{"$f":"MIN($B$9:$B$224)","v":0},{"$f":"Fähigkeitsnachweis!$C$14","v":0},{"$f":"Fähigkeitsnachweis!$G$14","v":0},{"$f":"Fähigkeitsnachweis!$C$29-(3*Fähigkeitsnachweis!$C$31)","v":{"$error":"#VALUE!"}},{"$f":"Fähigkeitsnachweis!$C$29+(3*Fähigkeitsnachweis!$C$31)","v":{"$error":"#VALUE!"}}]
[2,"",{"$f":"IF(Messergebnisse!B3=\"\",\"\",Messergebnisse!B3)","v":""},{"$f":"IF(C10=\"\",#N/A,C10)","v":{"$error":"#N/A"}},{"$f":"IF(C10=\"\",#N/A,SMALL(C$9:C$224,F10))","v":{"$error":"#N/A"}},{"$f":"IF(C10=\"\",\"\",F9+1)","v":""},{"$f":"IF(IF(C10=\"\",\"\",NORMSDIST((E10-$E$3)/$E$4))=1,0.999999999,IF(C10=\"\",\"\",NORMSDIST((E10-$E$3)/$E$4)))","v":""},{"$f":"IF(C10=\"\",\"\",1-G10)","v":""},{"$f":"IF(C10=\"\",\"\",SMALL(H$9:H$224,F10))","v":""},"",{"$f":"IF(C10=\"\",#N/A,NORMSINV((F10-0.3)/($E$2+0.4)))","v":{"$error":"#N/A"}},null,null,{"$f":"E3","v":""},0,null,{"$f":"$E$3","v":""},{"$f":"MAX($B$9:$B$224)","v":0},{"$f":"Fähigkeitsnachweis!$C$14","v":0},{"$f":"Fähigkeitsnachweis!$G$14","v":0},{"$f":"Fähigkeitsnachweis!$C$29-(3*Fähigkeitsnachweis!$C$31)","v":{"$error":"#VALUE!"}},{"$f":"Fähigkeitsnachweis!$C$29+(3*Fähigkeitsnachweis!$C$31)","v":{"$error":"#VALUE!"}}]
[3,"",{"$f":"IF(Messergebnisse!B4=\"\",\"\",Messergebnisse!B4)","v":""},{"$error":"#N/A"},{"$error":"#N/A"},{"$f":"IF(C11=\"\",\"\",F10+1)","v":""},"","","","",{"$error":"#N/A"},null,null,{"$f":"O11*E4+E3","v":{"$error":"#VALUE!"}},3]
[4,"",{"$f":"IF(Messergebnisse!B5=\"\",\"\",Messergebnisse!B5)","v":""},{"$error":"#N/A"},{"$error":"#N/A"},"","","","","",{"$error":"#N/A"}]
[5,"",{"$f":"IF(Messergebnisse!B6=\"\",\"\",Messergebnisse!B6)","v":""},{"$error":"#N/A"},{"$error":"#N/A"},"","","","","",{"$error":"#N/A"}]
[6,"",{"$f":"IF(Messergebnisse!B7=\"\",\"\",Messergebnisse!B7)","v":""},{"$error":"#N/A"},{"$error":"#N/A"},"","","","","",{"$error":"#N/A"}]
[7,"",{"$f":"IF(Messergebnisse!B8=\"\",\"\",Messergebnisse!B8)","v":""},{"$error":"#N/A"},{"$error":"#N/A"},"","","","","",{"$error":"#N/A"}]
[8,"",{"$f":"IF(Messergebnisse!B9=\"\",\"\",Messergebnisse!B9)","v":""},{"$error":"#N/A"},{"$error":"#N/A"},"","","","","",{"$error":"#N/A"}]
[9,"",{"$f":"IF(Messergebnisse!B10=\"\",\"\",Messergebnisse!B10)","v":""},{"$error":"#N/A"},{"$error":"#N/A"},"","","","","",{"$error":"#N/A"}]
[10,"",{"$f":"IF(Messergebnisse!B11=\"\",\"\",Messergebnisse!B11)","v":""},{"$error":"#N/A"},{"$error":"#N/A"},"","","","","",{"$error":"#N/A"}]
[11,"",{"$f":"IF(Messergebnisse!B12=\"\",\"\",Messergebnisse!B12)","v":""},{"$error":"#N/A"},{"$error":"#N/A"},"","","","","",{"$error":"#N/A"}]
[12,"",{"$f":"IF(Messergebnisse!B13=\"\",\"\",Messergebnisse!B13)","v":""},{"$error":"#N/A"},{"$error":"#N/A"},"","","","","",{"$error":"#N/A"}]
[13,"",{"$f":"IF(Messergebnisse!B14=\"\",\"\",Messergebnisse!B14)","v":""},{"$error":"#N/A"},{"$error":"#N/A"},"","","","","",{"$error":"#N/A"}]
[14,"",{"$f":"IF(Messergebnisse!B15=\"\",\"\",Messergebnisse!B15)","v":""},{"$error":"#N/A"},{"$error":"#N/A"},"","","","","",{"$error":"#N/A"}]
[15,"",{"$f":"IF(Messergebnisse!B16=\"\",\"\",Messergebnisse!B16)","v":""},{"$error":"#N/A"},{"$error":"#N/A"},"","","","","",{"$error":"#N/A"}]
[16,"",{"$f":"IF(Messergebnisse!B17=\"\",\"\",Messergebnisse!B17)","v":""},{"$error":"#N/A"},{"$error":"#N/A"},"","","","","",{"$error":"#N/A"}]
[17,"",{"$f":"IF(Messergebnisse!B18=\"\",\"\",Messergebnisse!B18)","v":""},{"$error":"#N/A"},{"$error":"#N/A"},"","","","","",{"$error":"#N/A"}]
[18,"",{"$f":"IF(Messergebnisse!B19=\"\",\"\",Messergebnisse!B19)","v":""},{"$error":"#N/A"},{"$error":"#N/A"},"","","","","",{"$error":"#N/A"}]
[19,"",{"$f":"IF(Messergebnisse!B20=\"\",\"\",Messergebnisse!B20)","v":""},{"$error":"#N/A"},{"$error":"#N/A"},"","","","","",{"$error":"#N/A"}]
[20,"",{"$f":"IF(Messergebnisse!B21=\"\",\"\",Messergebnisse!B21)","v":""},{"$error":"#N/A"},{"$error":"#N/A"},"","","","","",{"$error":"#N/A"}]
[21,"",{"$f":"IF(Messergebnisse!B22=\"\",\"\",Messergebnisse!B22)","v":""},{"$error":"#N/A"},{"$error":"#N/A"},"","","","","",{"$error":"#N/A"}]
[22,"",{"$f":"IF(Messergebnisse!B23=\"\",\"\",Messergebnisse!B23)","v":""},{"$error":"#N/A"},{"$error":"#N/A"},"","","","","",{"$error":"#N/A"}]
[23,"",{"$f":"IF(Messergebnisse!B24=\"\",\"\",Messergebnisse!B24)","v":""},{"$error":"#N/A"},{"$error":"#N/A"},"","","","","",{"$error":"#N/A"}]
[24,"",{"$f":"IF(Messergebnisse!B25=\"\",\"\",Messergebnisse!B25)","v":""},{"$error":"#N/A"},{"$error":"#N/A"},"","","","","",{"$error":"#N/A"}]
[25,"",{"$f":"IF(Messergebnisse!B26=\"\",\"\",Messergebnisse!B26)","v":""},{"$error":"#N/A"},{"$error":"#N/A"},"","","","","",{"$error":"#N/A"}]
[26,"",{"$f":"IF(Messergebnisse!B27=\"\",\"\",Messergebnisse!B27)","v":""},{"$error":"#N/A"},{"$error":"#N/A"},"","","","","",{"$error":"#N/A"}]
[27,"",{"$f":"IF(Messergebnisse!B28=\"\",\"\",Messergebnisse!B28)","v":""},{"$error":"#N/A"},{"$error":"#N/A"},"","","","","",{"$error":"#N/A"}]
[28,"",{"$f":"IF(Messergebnisse!B29=\"\",\"\",Messergebnisse!B29)","v":""},{"$error":"#N/A"},{"$error":"#N/A"},"","","","","",{"$error":"#N/A"}]
[29,"",{"$f":"IF(Messergebnisse!B30=\"\",\"\",Messergebnisse!B30)","v":""},{"$error":"#N/A"},{"$error":"#N/A"},"","","","","",{"$error":"#N/A"}]
[30,"",{"$f":"IF(Messergebnisse!B31=\"\",\"\",Messergebnisse!B31)","v":""},{"$error":"#N/A"},{"$error":"#N/A"},"","","","","",{"$error":"#N/A"}]
[31,"",{"$f":"IF(Messergebnisse!B32=\"\",\"\",Messergebnisse!B32)","v":""},{"$error":"#N/A"},{"$error":"#N/A"},"","","","","",{"$error":"#N/A"}]
[32,"",{"$f":"IF(Messergebnisse!B33=\"\",\"\",Messergebnisse!B33)","v":""},{"$error":"#N/A"},{"$error":"#N/A"},"","","","","",{"$error":"#N/A"}]
{"$rows_left_out":185}
{"sheet":"Umstellung","index":4,"n_rows":9,"n_cols":7,"rows_kept":9,"hidden":true}
["Maschinenfähigkeitsindex","Cmk","Cmk<","Cmk>","Cmku","Cmko","Cm"]
["Prozessleistungsindex","Ppk","Ppk<","Ppk>","Ppku","Ppko","Pp"]
["Prozessfähigkeitsindex","Cpk","Cpk<","Cpk>","Cpku","CPko","CP"]
[]
[]
[]
["Maschinenfähigkeitsindex",{"v":1.5,"d":"1.50"},1.33]
["Prozessleistungsindex",1.33,{"v":1,"d":"1.00"}]
["Prozessfähigkeitsindex",1.33,{"v":1,"d":"1.00"}]