{"text_format":"3","workbook":"xlsx","n_sheets":5,"sheets":["Messergebnisse","Fähigkeitsnachweis","Histogramm","Normalverteilung","Umstellung"],"not_rendered":{"charts":5,"images":2,"macros":1,"defined_names":7},"read":"whole","date_system":"1900"}

{"sheet":"Messergebnisse","index":0,"n_rows":55,"n_cols":7,"rows_kept":55,"merged":[[0,0,0,7]]}
["Messergebnisse / Measurement results"]
[1,null,55,null,109,null,163]
[2,null,56,null,110,null,164]
[3,null,57,null,111,null,165]
[4,null,58,null,112,null,166]
[5,null,59,null,113,null,167]
[6,null,60,null,114,null,168]
[7,null,61,null,115,null,169]
[8,null,62,null,116,null,170]
[9,null,63,null,117,null,171]
[10,null,64,null,118,null,172]
[11,null,65,null,119,null,173]
[12,null,66,null,120,null,174]
[13,null,67,null,121,null,175]
[14,null,68,null,122,null,176]
[15,null,69,null,123,null,177]
[16,null,70,null,124,null,178]
[17,null,71,null,125,null,179]
[18,null,72,null,126,null,180]
[19,null,73,null,127,null,181]
[20,null,74,null,128,null,182]
[21,null,75,null,129,null,183]
[22,null,76,null,130,null,184]
[23,null,77,null,131,null,185]
[24,null,78,null,132,null,186]
[25,null,79,null,133,null,187]
[26,null,80,null,134,null,188]
[27,null,81,null,135,null,189]
[28,null,82,null,136,null,190]
[29,null,83,null,137,null,191]
[30,null,84,null,138,null,192]
[31,null,85,null,139,null,193]
[32,null,86,null,140,null,194]
[33,null,87,null,141,null,195]
[34,null,88,null,142,null,196]
[35,null,89,null,143,null,197]
[36,null,90,null,144,null,198]
[37,null,91,null,145,null,199]
[38,null,92,null,146,null,200]
[39,null,93,null,147,null,201]
[40,null,94,null,148,null,202]
[41,null,95,null,149,null,203]
[42,null,96,null,150,null,204]
[43,null,97,null,151,null,205]
[44,null,98,null,152,null,206]
[45,null,99,null,153,null,207]
[46,null,100,null,154,null,208]
[47,null,101,null,155,null,209]
[48,null,102,null,156,null,210]
[49,null,103,null,157,null,211]
[50,null,104,null,158,null,212]
[51,null,105,null,159,null,213]
[52,null,106,null,160,null,214]
[53,null,107,null,161,null,215]
[54,null,108,null,162,null,216]

{"sheet":"Fähigkeitsnachweis","index":1,"n_rows":94,"n_cols":7,"rows_kept":94,"merged":[[1,1,2,3],[1,5,2,7],[3,1,4,3],[3,5,4,7],[5,0,5,1],[5,2,6,3],[5,5,6,7],[9,1,10,3],[11,1,12,3],[11,4,11,5],[11,6,12,7],[12,4,12,5],[13,0,13,1],[13,2,14,3],[13,4,13,5],[13,6,14,7],[14,0,14,1],[14,4,14,5],[16,0,16,7],[17,0,18,0],[17,1,18,1],[17,2,17,3],[18,2,18,3],[19,0,20,0],[19,1,20,1],[19,2,19,3],[20,2,20,3],[21,0,22,0],[21,1,22,1],[21,2,21,3],[22,2,22,3],[23,0,23,7],[24,0,24,1],[24,2,25,3],[24,4,24,5],[24,6,25,7],[25,0,25,1],[25,4,25,5],[26,0,26,1],[26,2,27,3],[26,4,26,5],[26,6,27,7],[27,0,27,1],[27,4,27,5],[28,0,28,1],[28,2,29,3],[28,4,28,5],[28,6,29,7],[29,0,29,1],[29,4,29,5],[30,0,30,1],[30,2,31,3],[30,4,30,5],[30,6,31,7],[31,0,31,1],[31,4,31,5],[32,0,33,1],[32,2,35,3],[34,0,35,1],[38,0,39,0],[38,1,39,2],[40,0,41,0],[40,1,41,2],[42,0,43,0],[42,1,43,2],[44,0,45,0],[44,1,45,2],[46,1,46,2],[47,1,47,2],[93,0,93,4]]}
["Stammdaten / Base data"]
["Artikelnnr.:",{"$nulls":3},"Prüfer:"]
["Part no.:",{"$nulls":3},"Inspector:"]
["Artikelbez.:",{"$nulls":3},"Datum:"]
["part descrip.:",{"$nulls":3},"Date:"]
["Zeichnungsnr. + Index:",{"$nulls":3},"Merkmal:"]
["Drawing No. + index.:",{"$nulls":3},"Characteristic:"]
[]
["Messangaben / Measurement details"]
["Messmittel:"]
["Measuring tools:"]
["Sollwert =",{"$nulls":3},"Maßeinheit:"]
["Target value =",{"$nulls":3},"Unit of measurement:"]
["Unter Grenzwert (UGW) =",{"$nulls":3},"Oberer Grenzwert (OGW) ="]
["Under limit value =",{"$nulls":3},"Upper limit value ="]
[null,null,1,{"$f":"IF(C16=2,\"Prozessleistungsindex\",IF(C16=3,\"Prozessfähigkeitsindex\",\"Maschinenfähigkeitsindex\"))","v":"Maschinenfähigkeitsindex"}]
["Berechnungswerte / calculation values"]
[{"$f":"VLOOKUP(D16,Umstellung!A1:D3,3,FALSE)","v":"Cmk<"},{"$f":"VLOOKUP(D16,Umstellung!A7:C9,3,FALSE)","v":1.33},"Prozess nicht fähig"]
[null,null,"Process not capable"]
[{"$f":"VLOOKUP(D16,Umstellung!A1:D3,2,FALSE)","v":"Cmk"},"zwischen","Prozess bedingt fähig"]
[null,null,"Process conditionally capable"]
[{"$f":"VLOOKUP(D16,Umstellung!A1:D3,4,FALSE)","v":"Cmk>"},{"$f":"VLOOKUP(D16,Umstellung!A7:C9,2,FALSE)","v":1.5},"Prozess fähig"]
[null,null,"Process capable"]
["Auswertung / Evaluation"]
["Anzahl Klassen Histogramm:",null,{"$f":"SQRT(C27)","v":0},null,"Median",null,{"$f":"IF(Messergebnisse!B2=\"\",\"\",MEDIAN(Messergebnisse!B2:B55,Messergebnisse!D2:D55,Messergebnisse!F2:F55,Messergebnisse!H2:H55))","v":""}]
["Nr. of classes histogram:",{"$nulls":3},"Median"]
["Umfang der Stichprobe:",null,{"$f":"COUNT(Messergebnisse!B2:B55,Messergebnisse!D2:D55,Messergebnisse!F2:F55,Messergebnisse!H2:H55)","v":0},null,"Spannweite R",null,{"$f":"G31-G29","v":0}]
["Sample size:",{"$nulls":3},"Range R"]
["Mittelwert µ:",null,{"$f":"IF(Messergebnisse!B2=\"\",\"\",AVERAGE(Messergebnisse!B2:B55,Messergebnisse!D2:D55,Messergebnisse!F2:F55,Messergebnisse!H2:H55))","v":""},null,"Minimum",null,{"$f":"MIN(Messergebnisse!B2:B55,Messergebnisse!D2:D55,Messergebnisse!F2:F55,Messergebnisse!H2:H55)","v":0}]
["Mean value:",{"$nulls":3},"Minimum"]
["Standardabweichung σ:",null,{"$f":"IF(Messergebnisse!B2=\"\",\"\",STDEV(Messergebnisse!B2:B55,Messergebnisse!D2:D55,Messergebnisse!F2:F55,Messergebnisse!H2:H55))","v":""},null,"Maximum",null,{"$f":"MAX(Messergebnisse!B2:B55,Messergebnisse!D2:D55,Messergebnisse!F2:F55,Messergebnisse!H2:H55)","v":0}]
["Standard deviation:",{"$nulls":3},"Maximum"]
["Die Werte sind nach \nAndersson Darling Test",null,{"$f":"IF(C31=\"\",\"\",IF(Normalverteilung!K5<0.05,\"nicht normalverteilt\",\"normalverteilt\"))","v":""}]
[]
["The values are after\nAndersson Darling test"]
[]
[]
["Fähigkeitswerte / Capability values"]
[{"$f":"VLOOKUP(D16,Umstellung!A1:F3,5,FALSE)","v":"Cmku"},{"$f":"IF(C29=\"\",\"\",(C29-C14)/(3*C31))","v":""}]
[]
[{"$f":"VLOOKUP(D16,Umstellung!A1:F3,6,FALSE)","v":"Cmko"},{"$f":"IF(C29=\"\",\"\",(G14-C29)/(3*C31))","v":""}]
[]
[{"$f":"VLOOKUP(D16,Umstellung!A1:G3,7,FALSE)","v":"Cm"},{"$f":"IF(C31=\"\",\"\",(G14-C14)/(6*C31))","v":""}]
[]
[{"$f":"VLOOKUP(D16,Umstellung!A1:G3,2,FALSE)","v":"Cmk"},{"$f":"IF(C29=\"\",\"\",MIN(C29-C14,G14-C29)/(3*C31))","v":""}]
[]
["Bewertung",{"$f":"IF(B45<B18,C18,IF(B45>B22,C22,C20))","v":"Prozess fähig"}]
["Evaluation",{"$f":"IF(B45<B18,C19,IF(B45>B23,C22,C21))","v":"Process conditionally capable"}]
{"$rows_empty":8}
["Histogramm / histogram"]
{"$rows_empty":19}
["Wahrscheinlichkeitsnetz / Probability network"]
{"$rows_empty":16}
["Chronologische Stichprobe / Chronological sample"]

{"sheet":"Histogramm","index":2,"n_rows":226,"n_cols":17,"rows_kept":226,"hidden":true,"merged":[[9,11,9,16]]}
["Umfang Stichprobe",{"$f":"Fähigkeitsnachweis!C27","v":0}]
["Mittelwert",{"$f":"Fähigkeitsnachweis!C29","v":""}]
["Standartabweichung",{"$f":"Fähigkeitsnachweis!C31","v":""}]
["Range der einzelnen Histogrammanzeigen",{"$f":"Fähigkeitsnachweis!G27/Fähigkeitsnachweis!C25","v":{"$error":"#DIV/0!"}}]
["Minimum Wert",{"$f":"Fähigkeitsnachweis!G29","v":0}]
["Maximum Wert",{"$f":"Fähigkeitsnachweis!G31","v":0}]
["Klassenanzahl",{"$f":"Fähigkeitsnachweis!C25","v":{"v":0,"d":"0.00"}}]
["Ganze zahl der Klassenanzahl",{"$f":"INT(B7)","v":0}]
[]
["Histogrammklasse","von ","bis","von (2 Dezimalen)","bis (2 Dezimalen)","Wie oft liegen Messwerte zwischen von bis","Zähler Messergebnisse","xi sortiert",null,"Max Wert Histogramm Kurve",null,"Diagramm Histogramm"]
[1,{"$f":"B5","v":{"v":0,"d":"0.00"}},{"$f":"IF(A11=$B$8,$B$6,IF($B$7>=A12,SUM(B11+$B$4),#N/A))","v":{"$error":"#N/A"}},{"$f":"IF(B11=\"\",\"\",FIXED(B11,2))","v":"0,00"},{"$f":"IF(C11=\"\",#N/A,FIXED(C11,2))","v":{"$error":"#N/A"}},{"$f":"IF(C11=\"\",\"\",COUNTIFS(Normalverteilung!$C$9:$C$224,\">=\"&B11,Normalverteilung!$C$9:$C$224,\"<=\"&C11))","v":{"$error":"#N/A"}},1,{"$f":"IF(Normalverteilung!E9=\"#NV\",\"\",Normalverteilung!E9)","v":{"$error":"#N/A"}},{"$f":"_xlfn.NORM.DIST(H11,$B$2,$B$3,FALSE)*$B$1","v":{"$error":"#N/A"}},{"$f":"MAX(IF(ISERROR(I11:I226),,I11:I226))","v":0},null," Mittelwert",null,"UGW","OGW","- 3 Sigma","+ 3 Sigma"]
[2,{"$f":"IF(A12=(SUM($B$8+1)),#N/A,IF(C11=\"\",#N/A,C11+0.01))","v":{"$error":"#N/A"}},{"$f":"IF(A12=$B$8,$B$6,IF($B$7>=A13,SUM(B12+$B$4),#N/A))","v":{"$error":"#N/A"}},{"$f":"IF(B12=\"\",\"\",FIXED(B12,2))","v":{"$error":"#N/A"}},{"$error":"#N/A"},{"$f":"IF(C12=\"\",\"\",COUNTIFS(Normalverteilung!$C$9:$C$224,\">=\"&B12,Normalverteilung!$C$9:$C$224,\"<=\"&C12))","v":{"$error":"#N/A"}},2,{"$f":"IF(Normalverteilung!E10=\"#NV\",\"\",Normalverteilung!E10)","v":{"$error":"#N/A"}},{"$f":"_xlfn.NORM.DIST(H12,$B$2,$B$3,FALSE)*$B$1","v":{"$error":"#N/A"}},null,null,"Wert x","Wert y","Wert x","Wert x","Wert x","Wert x"]
[3,{"$error":"#N/A"},{"$error":"#N/A"},{"$error":"#N/A"},{"$error":"#N/A"},{"$f":"IF(C13=\"\",\"\",COUNTIFS(Normalverteilung!$C$9:$C$224,\">=\"&B13,Normalverteilung!$C$9:$C$224,\"<=\"&C13))","v":{"$error":"#N/A"}},3,{"$f":"IF(Normalverteilung!E11=\"#NV\",\"\",Normalverteilung!E11)","v":{"$error":"#N/A"}},{"$error":"#N/A"},null,null,{"$f":"Normalverteilung!$E$3","v":""},0,{"$f":"Fähigkeitsnachweis!$C$14","v":0},{"$f":"Fähigkeitsnachweis!$G$14","v":0},{"$f":"Fähigkeitsnachweis!$C$29-(3*Fähigkeitsnachweis!$C$31)","v":{"$error":"#VALUE!"}},{"$f":"Fähigkeitsnachweis!$C$29+(3*Fähigkeitsnachweis!$C$31)","v":{"$error":"#VALUE!"}}]
[4,{"$error":"#N/A"},{"$error":"#N/A"},{"$error":"#N/A"},{"$error":"#N/A"},{"$f":"IF(C14=\"\",\"\",COUNTIFS(Normalverteilung!$C$9:$C$224,\">=\"&B14,Normalverteilung!$C$9:$C$224,\"<=\"&C14))","v":{"$error":"#N/A"}},4,{"$f":"IF(Normalverteilung!E12=\"#NV\",\"\",Normalverteilung!E12)","v":{"$error":"#N/A"}},{"$error":"#N/A"},null,null,{"$f":"Normalverteilung!$E$3","v":""},{"$f":"J11","v":0},{"$f":"Fähigkeitsnachweis!$C$14","v":0},{"$f":"Fähigkeitsnachweis!$G$14","v":0},{"$f":"Fähigkeitsnachweis!$C$29-(3*Fähigkeitsnachweis!$C$31)","v":{"$error":"#VALUE!"}},{"$f":"Fähigkeitsnachweis!$C$29+(3*Fähigkeitsnachweis!$C$31)","v":{"$error":"#VALUE!"}}]
[5,{"$error":"#N/A"},{"$error":"#N/A"},{"$error":"#N/A"},{"$error":"#N/A"},{"$f":"IF(C15=\"\",\"\",COUNTIFS(Normalverteilung!$C$9:$C$224,\">=\"&B15,Normalverteilung!$C$9:$C$224,\"<=\"&C15))","v":{"$error":"#N/A"}},5,{"$f":"IF(Normalverteilung!E13=\"#NV\",\"\",Normalverteilung!E13)","v":{"$error":"#N/A"}},{"$error":"#N/A"}]
[6,{"$error":"#N/A"},{"$error":"#N/A"},{"$error":"#N/A"},{"$error":"#N/A"},{"$f":"IF(C16=\"\",\"\",COUNTIFS(Normalverteilung!$C$9:$C$224,\">=\"&B16,Normalverteilung!$C$9:$C$224,\"<=\"&C16))","v":{"$error":"#N/A"}},6,{"$f":"IF(Normalverteilung!E14=\"#NV\",\"\",Normalverteilung!E14)","v":{"$error":"#N/A"}},{"$error":"#N/A"}]
[7,{"$error":"#N/A"},{"$error":"#N/A"},{"$error":"#N/A"},{"$error":"#N/A"},{"$f":"IF(C17=\"\",\"\",COUNTIFS(Normalverteilung!$C$9:$C$224,\">=\"&B17,Normalverteilung!$C$9:$C$224,\"<=\"&C17))","v":{"$error":"#N/A"}},7,{"$f":"IF(Normalverteilung!E15=\"#NV\",\"\",Normalverteilung!E15)","v":{"$error":"#N/A"}},{"$error":"#N/A"}]
[8,{"$error":"#N/A"},{"$error":"#N/A"},{"$error":"#N/A"},{"$error":"#N/A"},{"$f":"IF(C18=\"\",\"\",COUNTIFS(Normalverteilung!$C$9:$C$224,\">=\"&B18,Normalverteilung!$C$9:$C$224,\"<=\"&C18))","v":{"$error":"#N/A"}},8,{"$f":"IF(Normalverteilung!E16=\"#NV\",\"\",Normalverteilung!E16)","v":{"$error":"#N/A"}},{"$error":"#N/A"}]
[9,{"$error":"#N/A"},{"$error":"#N/A"},{"$error":"#N/A"},{"$error":"#N/A"},{"$f":"IF(C19=\"\",\"\",COUNTIFS(Normalverteilung!$C$9:$C$224,\">=\"&B19,Normalverteilung!$C$9:$C$224,\"<=\"&C19))","v":{"$error":"#N/A"}},9,{"$f":"IF(Normalverteilung!E17=\"#NV\",\"\",Normalverteilung!E17)","v":{"$error":"#N/A"}},{"$error":"#N/A"}]
[10,{"$error":"#N/A"},{"$error":"#N/A"},{"$error":"#N/A"},{"$error":"#N/A"},{"$f":"IF(C20=\"\",\"\",COUNTIFS(Normalverteilung!$C$9:$C$224,\">=\"&B20,Normalverteilung!$C$9:$C$224,\"<=\"&C20))","v":{"$error":"#N/A"}},10,{"$f":"IF(Normalverteilung!E18=\"#NV\",\"\",Normalverteilung!E18)","v":{"$error":"#N/A"}},{"$error":"#N/A"}]
[11,{"$f":"IF(A21=(SUM($B$8+1)),#N/A,IF(C20=\"\",#N/A,C20+0.01))","v":{"$error":"#N/A"}},{"$error":"#N/A"},{"$error":"#N/A"},{"$f":"IF(C21=\"\",#N/A,FIXED(C21,2))","v":{"$error":"#N/A"}},{"$f":"IF(C21=\"\",\"#NV\",COUNTIFS(Normalverteilung!$C$9:$C$224,\">=\"&B21,Normalverteilung!$C$9:$C$224,\"<=\"&C21))","v":{"$error":"#N/A"}},11,{"$f":"IF(Normalverteilung!E19=\"#NV\",\"\",Normalverteilung!E19)","v":{"$error":"#N/A"}},{"$error":"#N/A"}]
[12,{"$f":"IF(A22=(SUM($B$8+1)),#N/A,IF(C21=\"\",#N/A,C21+0.01))","v":{"$error":"#N/A"}},{"$error":"#N/A"},{"$error":"#N/A"},{"$f":"IF(C22=\"\",#N/A,FIXED(C22,2))","v":{"$error":"#N/A"}},{"$f":"IF(C22=\"\",\"#NV\",COUNTIFS(Normalverteilung!$C$9:$C$224,\">=\"&B22,Normalverteilung!$C$9:$C$224,\"<=\"&C22))","v":{"$error":"#N/A"}},12,{"$f":"IF(Normalverteilung!E20=\"#NV\",\"\",Normalverteilung!E20)","v":{"$error":"#N/A"}},{"$error":"#N/A"}]
[13,{"$error":"#N/A"},{"$error":"#N/A"},{"$error":"#N/A"},{"$error":"#N/A"},{"$f":"IF(C23=\"\",\"#NV\",COUNTIFS(Normalverteilung!$C$9:$C$224,\">=\"&B23,Normalverteilung!$C$9:$C$224,\"<=\"&C23))","v":{"$error":"#N/A"}},13,{"$f":"IF(Normalverteilung!E21=\"#NV\",\"\",Normalverteilung!E21)","v":{"$error":"#N/A"}},{"$error":"#N/A"}]
[14,{"$error":"#N/A"},{"$error":"#N/A"},{"$error":"#N/A"},{"$error":"#N/A"},{"$f":"IF(C24=\"\",\"#NV\",COUNTIFS(Normalverteilung!$C$9:$C$224,\">=\"&B24,Normalverteilung!$C$9:$C$224,\"<=\"&C24))","v":{"$error":"#N/A"}},14,{"$f":"IF(Normalverteilung!E22=\"#NV\",\"\",Normalverteilung!E22)","v":{"$error":"#N/A"}},{"$error":"#N/A"}]
[15,{"$error":"#N/A"},{"$error":"#N/A"},{"$error":"#N/A"},{"$error":"#N/A"},{"$f":"IF(C25=\"\",\"#NV\",COUNTIFS(Normalverteilung!$C$9:$C$224,\">=\"&B25,Normalverteilung!$C$9:$C$224,\"<=\"&C25))","v":{"$error":"#N/A"}},15,{"$f":"IF(Normalverteilung!E23=\"#NV\",\"\",Normalverteilung!E23)","v":{"$error":"#N/A"}},{"$error":"#N/A"}]
[16,{"$error":"#N/A"},{"$error":"#N/A"},{"$error":"#N/A"},{"$error":"#N/A"},{"$f":"IF(C26=\"\",\"#NV\",COUNTIFS(Normalverteilung!$C$9:$C$224,\">=\"&B26,Normalverteilung!$C$9:$C$224,\"<=\"&C26))","v":{"$error":"#N/A"}},16,{"$f":"IF(Normalverteilung!E24=\"#NV\",\"\",Normalverteilung!E24)","v":{"$error":"#N/A"}},{"$error":"#N/A"}]
[17,{"$error":"#N/A"},{"$error":"#N/A"},{"$error":"#N/A"},{"$error":"#N/A"},{"$f":"IF(C27=\"\",\"#NV\",COUNTIFS(Normalverteilung!$C$9:$C$224,\">=\"&B27,Normalverteilung!$C$9:$C$224,\"<=\"&C27))","v":{"$error":"#N/A"}},17,{"$f":"IF(Normalverteilung!E25=\"#NV\",\"\",Normalverteilung!E25)","v":{"$error":"#N/A"}},{"$error":"#N/A"}]
[18,{"$error":"#N/A"},{"$error":"#N/A"},{"$error":"#N/A"},{"$error":"#N/A"},{"$f":"IF(C28=\"\",\"#NV\",COUNTIFS(Normalverteilung!$C$9:$C$224,\">=\"&B28,Normalverteilung!$C$9:$C$224,\"<=\"&C28))","v":{"$error":"#N/A"}},18,{"$f":"IF(Normalverteilung!E26=\"#NV\",\"\",Normalverteilung!E26)","v":{"$error":"#N/A"}},{"$error":"#N/A"}]
[19,{"$error":"#N/A"},{"$error":"#N/A"},{"$error":"#N/A"},{"$error":"#N/A"},{"$f":"IF(C29=\"\",\"#NV\",COUNTIFS(Normalverteilung!$C$9:$C$224,\">=\"&B29,Normalverteilung!$C$9:$C$224,\"<=\"&C29))","v":{"$error":"#N/A"}},19,{"$f":"IF(Normalverteilung!E27=\"#NV\",\"\",Normalverteilung!E27)","v":{"$error":"#N/A"}},{"$error":"#N/A"}]
[20,{"$error":"#N/A"},{"$error":"#N/A"},{"$error":"#N/A"},{"$error":"#N/A"},{"$f":"IF(C30=\"\",\"#NV\",COUNTIFS(Normalverteilung!$C$9:$C$224,\">=\"&B30,Normalverteilung!$C$9:$C$224,\"<=\"&C30))","v":{"$error":"#N/A"}},20,{"$f":"IF(Normalverteilung!E28=\"#NV\",\"\",Normalverteilung!E28)","v":{"$error":"#N/A"}},{"$error":"#N/A"}]
[21,{"$error":"#N/A"},{"$error":"#N/A"},{"$error":"#N/A"},{"$error":"#N/A"},{"$f":"IF(C31=\"\",\"#NV\",COUNTIFS(Normalverteilung!$C$9:$C$224,\">=\"&B31,Normalverteilung!$C$9:$C$224,\"<=\"&C31))","v":{"$error":"#N/A"}},21,{"$f":"IF(Normalverteilung!E29=\"#NV\",\"\",Normalverteilung!E29)","v":{"$error":"#N/A"}},{"$error":"#N/A"}]
[22,{"$error":"#N/A"},{"$error":"#N/A"},{"$error":"#N/A"},{"$error":"#N/A"},{"$f":"IF(C32=\"\",\"#NV\",COUNTIFS(Normalverteilung!$C$9:$C$224,\">=\"&B32,Normalverteilung!$C$9:$C$224,\"<=\"&C32))","v":{"$error":"#N/A"}},22,{"$f":"IF(Normalverteilung!E30=\"#NV\",\"\",Normalverteilung!E30)","v":{"$error":"#N/A"}},{"$error":"#N/A"}]
[23,{"$error":"#N/A"},{"$error":"#N/A"},{"$error":"#N/A"},{"$error":"#N/A"},{"$f":"IF(C33=\"\",\"#NV\",COUNTIFS(Normalverteilung!$C$9:$C$224,\">=\"&B33,Normalverteilung!$C$9:$C$224,\"<=\"&C33))","v":{"$error":"#N/A"}},23,{"$f":"IF(Normalverteilung!E31=\"#NV\",\"\",Normalverteilung!E31)","v":{"$error":"#N/A"}},{"$error":"#N/A"}]
[24,{"$error":"#N/A"},{"$error":"#N/A"},{"$error":"#N/A"},{"$error":"#N/A"},{"$f":"IF(C34=\"\",\"#NV\",COUNTIFS(Normalverteilung!$C$9:$C$224,\">=\"&B34,Normalverteilung!$C$9:$C$224,\"<=\"&C34))","v":{"$error":"#N/A"}},24,{"$f":"IF(Normalverteilung!E32=\"#NV\",\"\",Normalverteilung!E32)","v":{"$error":"#N/A"}},{"$error":"#N/A"}]
[25,{"$error":"#N/A"},{"$f":"IF(B35<>#N/A,B6,#N/A)","v":{"$error":"#N/A"}},{"$error":"#N/A"},{"$error":"#N/A"},{"$f":"IF(C35=\"\",\"#NV\",COUNTIFS(Normalverteilung!$C$9:$C$224,\">=\"&B35,Normalverteilung!$C$9:$C$224,\"<=\"&C35))","v":{"$error":"#N/A"}},25,{"$f":"IF(Normalverteilung!E33=\"#NV\",\"\",Normalverteilung!E33)","v":{"$error":"#N/A"}},{"$error":"#N/A"}]
[{"$nulls":6},26,{"$f":"IF(Normalverteilung!E34=\"#NV\",\"\",Normalverteilung!E34)","v":{"$error":"#N/A"}},{"$error":"#N/A"}]
[{"$nulls":6},27,{"$f":"IF(Normalverteilung!E35=\"#NV\",\"\",Normalverteilung!E35)","v":{"$error":"#N/A"}},{"$error":"#N/A"}]
[{"$nulls":6},28,{"$f":"IF(Normalverteilung!E36=\"#NV\",\"\",Normalverteilung!E36)","v":{"$error":"#N/A"}},{"$error":"#N/A"}]
[{"$nulls":6},29,{"$f":"IF(Normalverteilung!E37=\"#NV\",\"\",Normalverteilung!E37)","v":{"$error":"#N/A"}},{"$error":"#N/A"}]
[{"$nulls":6},30,{"$f":"IF(Normalverteilung!E38=\"#NV\",\"\",Normalverteilung!E38)","v":{"$error":"#N/A"}},{"$error":"#N/A"}]
[{"$nulls":6},31,{"$f":"IF(Normalverteilung!E39=\"#NV\",\"\",Normalverteilung!E39)","v":{"$error":"#N/A"}},{"$error":"#N/A"}]
[{"$nulls":6},32,{"$f":"IF(Normalverteilung!E40=\"#NV\",\"\",Normalverteilung!E40)","v":{"$error":"#N/A"}},{"$error":"#N/A"}]
[{"$nulls":6},33,{"$f":"IF(Normalverteilung!E41=\"#NV\",\"\",Normalverteilung!E41)","v":{"$error":"#N/A"}},{"$error":"#N/A"}]
[{"$nulls":6},34,{"$f":"IF(Normalverteilung!E42=\"#NV\",\"\",Normalverteilung!E42)","v":{"$error":"#N/A"}},{"$error":"#N/A"}]
[{"$nulls":6},35,{"$f":"IF(Normalverteilung!E43=\"#NV\",\"\",Normalverteilung!E43)","v":{"$error":"#N/A"}},{"$error":"#N/A"}]
[{"$nulls":6},36,{"$f":"IF(Normalverteilung!E44=\"#NV\",\"\",Normalverteilung!E44)","v":{"$error":"#N/A"}},{"$error":"#N/A"}]
[{"$nulls":6},37,{"$f":"IF(Normalverteilung!E45=\"#NV\",\"\",Normalverteilung!E45)","v":{"$error":"#N/A"}},{"$error":"#N/A"}]
[{"$nulls":6},38,{"$f":"IF(Normalverteilung!E46=\"#NV\",\"\",Normalverteilung!E46)","v":{"$error":"#N/A"}},{"$error":"#N/A"}]
[{"$nulls":6},39,{"$f":"IF(Normalverteilung!E47=\"#NV\",\"\",Normalverteilung!E47)","v":{"$error":"#N/A"}},{"$error":"#N/A"}]
[{"$nulls":6},40,{"$f":"IF(Normalverteilung!E48=\"#NV\",\"\",Normalverteilung!E48)","v":{"$error":"#N/A"}},{"$error":"#N/A"}]
[{"$nulls":6},41,{"$f":"IF(Normalverteilung!E49=\"#NV\",\"\",Normalverteilung!E49)","v":{"$error":"#N/A"}},{"$error":"#N/A"}]
[{"$nulls":6},42,{"$f":"IF(Normalverteilung!E50=\"#NV\",\"\",Normalverteilung!E50)","v":{"$error":"#N/A"}},{"$error":"#N/A"}]
[{"$nulls":6},43,{"$f":"IF(Normalverteilung!E51=\"#NV\",\"\",Normalverteilung!E51)","v":{"$error":"#N/A"}},{"$error":"#N/A"}]
[{"$nulls":6},44,{"$f":"IF(Normalverteilung!E52=\"#NV\",\"\",Normalverteilung!E52)","v":{"$error":"#N/A"}},{"$error":"#N/A"}]
[{"$nulls":6},45,{"$f":"IF(Normalverteilung!E53=\"#NV\",\"\",Normalverteilung!E53)","v":{"$error":"#N/A"}},{"$error":"#N/A"}]
[{"$nulls":6},46,{"$f":"IF(Normalverteilung!E54=\"#NV\",\"\",Normalverteilung!E54)","v":{"$error":"#N/A"}},{"$error":"#N/A"}]
[{"$nulls":6},47,{"$f":"IF(Normalverteilung!E55=\"#NV\",\"\",Normalverteilung!E55)","v":{"$error":"#N/A"}},{"$error":"#N/A"}]
[{"$nulls":6},48,{"$f":"IF(Normalverteilung!E56=\"#NV\",\"\",Normalverteilung!E56)","v":{"$error":"#N/A"}},{"$error":"#N/A"}]
[{"$nulls":6},49,{"$f":"IF(Normalverteilung!E57=\"#NV\",\"\",Normalverteilung!E57)","v":{"$error":"#N/A"}},{"$error":"#N/A"}]
[{"$nulls":6},50,{"$f":"IF(Normalverteilung!E58=\"#NV\",\"\",Normalverteilung!E58)","v":{"$error":"#N/A"}},{"$error":"#N/A"}]
[{"$nulls":6},51,{"$f":"IF(Normalverteilung!E59=\"#NV\",\"\",Normalverteilung!E59)","v":{"$error":"#N/A"}},{"$error":"#N/A"}]
[{"$nulls":6},52,{"$f":"IF(Normalverteilung!E60=\"#NV\",\"\",Normalverteilung!E60)","v":{"$error":"#N/A"}},{"$error":"#N/A"}]
[{"$nulls":6},53,{"$f":"IF(Normalverteilung!E61=\"#NV\",\"\",Normalverteilung!E61)","v":{"$error":"#N/A"}},{"$error":"#N/A"}]
[{"$nulls":6},54,{"$f":"IF(Normalverteilung!E62=\"#NV\",\"\",Normalverteilung!E62)","v":{"$error":"#N/A"}},{"$error":"#N/A"}]
[{"$nulls":6},55,{"$f":"IF(Normalverteilung!E63=\"#NV\",\"\",Normalverteilung!E63)","v":{"$error":"#N/A"}},{"$error":"#N/A"}]
[{"$nulls":6},56,{"$f":"IF(Normalverteilung!E64=\"#NV\",\"\",Normalverteilung!E64)","v":{"$error":"#N/A"}},{"$error":"#N/A"}]
[{"$nulls":6},57,{"$f":"IF(Normalverteilung!E65=\"#NV\",\"\",Normalverteilung!E65)","v":{"$error":"#N/A"}},{"$error":"#N/A"}]
[{"$nulls":6},58,{"$f":"IF(Normalverteilung!E66=\"#NV\",\"\",Normalverteilung!E66)","v":{"$error":"#N/A"}},{"$error":"#N/A"}]
[{"$nulls":6},59,{"$f":"IF(Normalverteilung!E67=\"#NV\",\"\",Normalverteilung!E67)","v":{"$error":"#N/A"}},{"$error":"#N/A"}]
[{"$nulls":6},60,{"$f":"IF(Normalverteilung!E68=\"#NV\",\"\",Normalverteilung!E68)","v":{"$error":"#N/A"}},{"$error":"#N/A"}]
[{"$nulls":6},61,{"$f":"IF(Normalverteilung!E69=\"#NV\",\"\",Normalverteilung!E69)","v":{"$error":"#N/A"}},{"$error":"#N/A"}]
[{"$nulls":6},62,{"$f":"IF(Normalverteilung!E70=\"#NV\",\"\",Normalverteilung!E70)","v":{"$error":"#N/A"}},{"$error":"#N/A"}]
[{"$nulls":6},63,{"$f":"IF(Normalverteilung!E71=\"#NV\",\"\",Normalverteilung!E71)","v":{"$error":"#N/A"}},{"$error":"#N/A"}]
[{"$nulls":6},64,{"$f":"IF(Normalverteilung!E72=\"#NV\",\"\",Normalverteilung!E72)","v":{"$error":"#N/A"}},{"$error":"#N/A"}]
[{"$nulls":6},65,{"$f":"IF(Normalverteilung!E73=\"#NV\",\"\",Normalverteilung!E73)","v":{"$error":"#N/A"}},{"$error":"#N/A"}]
[{"$nulls":6},66,{"$f":"IF(Normalverteilung!E74=\"#NV\",\"\",Normalverteilung!E74)","v":{"$error":"#N/A"}},{"$f":"_xlfn.NORM.DIST(H76,$B$2,$B$3,FALSE)*$B$1","v":{"$error":"#N/A"}}]
[{"$nulls":6},67,{"$f":"IF(Normalverteilung!E75=\"#NV\",\"\",Normalverteilung!E75)","v":{"$error":"#N/A"}},{"$error":"#N/A"}]
[{"$nulls":6},68,{"$f":"IF(Normalverteilung!E76=\"#NV\",\"\",Normalverteilung!E76)","v":{"$error":"#N/A"}},{"$error":"#N/A"}]
[{"$nulls":6},69,{"$f":"IF(Normalverteilung!E77=\"#NV\",\"\",Normalverteilung!E77)","v":{"$error":"#N/A"}},{"$error":"#N/A"}]
[{"$nulls":6},70,{"$f":"IF(Normalverteilung!E78=\"#NV\",\"\",Normalverteilung!E78)","v":{"$error":"#N/A"}},{"$error":"#N/A"}]
[{"$nulls":6},71,{"$f":"IF(Normalverteilung!E79=\"#NV\",\"\",Normalverteilung!E79)","v":{"$error":"#N/A"}},{"$error":"#N/A"}]
[{"$nulls":6},72,{"$f":"IF(Normalverteilung!E80=\"#NV\",\"\",Normalverteilung!E80)","v":{"$error":"#N/A"}},{"$error":"#N/A"}]
[{"$nulls":6},73,{"$f":"IF(Normalverteilung!E81=\"#NV\",\"\",Normalverteilung!E81)","v":{"$error":"#N/A"}},{"$error":"#N/A"}]
[{"$nulls":6},74,{"$f":"IF(Normalverteilung!E82=\"#NV\",\"\",Normalverteilung!E82)","v":{"$error":"#N/A"}},{"$error":"#N/A"}]
[{"$nulls":6},75,{"$f":"IF(Normalverteilung!E83=\"#NV\",\"\",Normalverteilung!E83)","v":{"$error":"#N/A"}},{"$error":"#N/A"}]
[{"$nulls":6},76,{"$f":"IF(Normalverteilung!E84=\"#NV\",\"\",Normalverteilung!E84)","v":{"$error":"#N/A"}},{"$error":"#N/A"}]
[{"$nulls":6},77,{"$f":"IF(Normalverteilung!E85=\"#NV\",\"\",Normalverteilung!E85)","v":{"$error":"#N/A"}},{"$error":"#N/A"}]
[{"$nulls":6},78,{"$f":"IF(Normalverteilung!E86=\"#NV\",\"\",Normalverteilung!E86)","v":{"$error":"#N/A"}},{"$error":"#N/A"}]
[{"$nulls":6},79,{"$f":"IF(Normalverteilung!E87=\"#NV\",\"\",Normalverteilung!E87)","v":{"$error":"#N/A"}},{"$error":"#N/A"}]
[{"$nulls":6},80,{"$f":"IF(Normalverteilung!E88=\"#NV\",\"\",Normalverteilung!E88)","v":{"$error":"#N/A"}},{"$error":"#N/A"}]
[{"$nulls":6},81,{"$f":"IF(Normalverteilung!E89=\"#NV\",\"\",Normalverteilung!E89)","v":{"$error":"#N/A"}},{"$error":"#N/A"}]
[{"$nulls":6},82,{"$f":"IF(Normalverteilung!E90=\"#NV\",\"\",Normalverteilung!E90)","v":{"$error":"#N/A"}},{"$error":"#N/A"}]
[{"$nulls":6},83,{"$f":"IF(Normalverteilung!E91=\"#NV\",\"\",Normalverteilung!E91)","v":{"$error":"#N/A"}},{"$error":"#N/A"}]
[{"$nulls":6},84,{"$f":"IF(Normalverteilung!E92=\"#NV\",\"\",Normalverteilung!E92)","v":{"$error":"#N/A"}},{"$error":"#N/A"}]
[{"$nulls":6},85,{"$f":"IF(Normalverteilung!E93=\"#NV\",\"\",Normalverteilung!E93)","v":{"$error":"#N/A"}},{"$error":"#N/A"}]
[{"$nulls":6},86,{"$f":"IF(Normalverteilung!E94=\"#NV\",\"\",Normalverteilung!E94)","v":{"$error":"#N/A"}},{"$error":"#N/A"}]
[{"$nulls":6},87,{"$f":"IF(Normalverteilung!E95=\"#NV\",\"\",Normalverteilung!E95)","v":{"$error":"#N/A"}},{"$error":"#N/A"}]
[{"$nulls":6},88,{"$f":"IF(Normalverteilung!E96=\"#NV\",\"\",Normalverteilung!E96)","v":{"$error":"#N/A"}},{"$error":"#N/A"}]
[{"$nulls":6},89,{"$f":"IF(Normalverteilung!E97=\"#NV\",\"\",Normalverteilung!E97)","v":{"$error":"#N/A"}},{"$error":"#N/A"}]
[{"$nulls":6},90,{"$f":"IF(Normalverteilung!E98=\"#NV\",\"\",Normalverteilung!E98)","v":{"$error":"#N/A"}},{"$error":"#N/A"}]
[{"$nulls":6},91,{"$f":"IF(Normalverteilung!E99=\"#NV\",\"\",Normalverteilung!E99)","v":{"$error":"#N/A"}},{"$error":"#N/A"}]
[{"$nulls":6},92,{"$f":"IF(Normalverteilung!E100=\"#NV\",\"\",Normalverteilung!E100)","v":{"$error":"#N/A"}},{"$error":"#N/A"}]
[{"$nulls":6},93,{"$f":"IF(Normalverteilung!E101=\"#NV\",\"\",Normalverteilung!E101)","v":{"$error":"#N/A"}},{"$error":"#N/A"}]
[{"$nulls":6},94,{"$f":"IF(Normalverteilung!E102=\"#NV\",\"\",Normalverteilung!E102)","v":{"$error":"#N/A"}},{"$error":"#N/A"}]
[{"$nulls":6},95,{"$f":"IF(Normalverteilung!E103=\"#NV\",\"\",Normalverteilung!E103)","v":{"$error":"#N/A"}},{"$error":"#N/A"}]
[{"$nulls":6},96,{"$f":"IF(Normalverteilung!E104=\"#NV\",\"\",Normalverteilung!E104)","v":{"$error":"#N/A"}},{"$error":"#N/A"}]
[{"$nulls":6},97,{"$f":"IF(Normalverteilung!E105=\"#NV\",\"\",Normalverteilung!E105)","v":{"$error":"#N/A"}},{"$error":"#N/A"}]
[{"$nulls":6},98,{"$f":"IF(Normalverteilung!E106=\"#NV\",\"\",Normalverteilung!E106)","v":{"$error":"#N/A"}},{"$error":"#N/A"}]
[{"$nulls":6},99,{"$f":"IF(Normalverteilung!E107=\"#NV\",\"\",Normalverteilung!E107)","v":{"$error":"#N/A"}},{"$error":"#N/A"}]
[{"$nulls":6},100,{"$f":"IF(Normalverteilung!E108=\"#NV\",\"\",Normalverteilung!E108)","v":{"$error":"#N/A"}},{"$error":"#N/A"}]
[{"$nulls":6},101,{"$f":"IF(Normalverteilung!E109=\"#NV\",\"\",Normalverteilung!E109)","v":{"$error":"#N/A"}},{"$error":"#N/A"}]
[{"$nulls":6},102,{"$f":"IF(Normalverteilung!E110=\"#NV\",\"\",Normalverteilung!E110)","v":{"$error":"#N/A"}},{"$error":"#N/A"}]
[{"$nulls":6},103,{"$f":"IF(Normalverteilung!E111=\"#NV\",\"\",Normalverteilung!E111)","v":{"$error":"#N/A"}},{"$error":"#N/A"}]
[{"$nulls":6},104,{"$f":"IF(Normalverteilung!E112=\"#NV\",\"\",Normalverteilung!E112)","v":{"$error":"#N/A"}},{"$error":"#N/A"}]
[{"$nulls":6},105,{"$f":"IF(Normalverteilung!E113=\"#NV\",\"\",Normalverteilung!E113)","v":{"$error":"#N/A"}},{"$error":"#N/A"}]
[{"$nulls":6},106,{"$f":"IF(Normalverteilung!E114=\"#NV\",\"\",Normalverteilung!E114)","v":{"$error":"#N/A"}},{"$error":"#N/A"}]
[{"$nulls":6},107,{"$f":"IF(Normalverteilung!E115=\"#NV\",\"\",Normalverteilung!E115)","v":{"$error":"#N/A"}},{"$error":"#N/A"}]
[{"$nulls":6},108,{"$f":"IF(Normalverteilung!E116=\"#NV\",\"\",Normalverteilung!E116)","v":{"$error":"#N/A"}},{"$error":"#N/A"}]
[{"$nulls":6},109,{"$f":"IF(Normalverteilung!E117=\"#NV\",\"\",Normalverteilung!E117)","v":{"$error":"#N/A"}},{"$error":"#N/A"}]
[{"$nulls":6},110,{"$f":"IF(Normalverteilung!E118=\"#NV\",\"\",Normalverteilung!E118)","v":{"$error":"#N/A"}},{"$error":"#N/A"}]
[{"$nulls":6},111,{"$f":"IF(Normalverteilung!E119=\"#NV\",\"\",Normalverteilung!E119)","v":{"$error":"#N/A"}},{"$error":"#N/A"}]
[{"$nulls":6},112,{"$f":"IF(Normalverteilung!E120=\"#NV\",\"\",Normalverteilung!E120)","v":{"$error":"#N/A"}},{"$error":"#N/A"}]
[{"$nulls":6},113,{"$f":"IF(Normalverteilung!E121=\"#NV\",\"\",Normalverteilung!E121)","v":{"$error":"#N/A"}},{"$error":"#N/A"}]
[{"$nulls":6},114,{"$f":"IF(Normalverteilung!E122=\"#NV\",\"\",Normalverteilung!E122)","v":{"$error":"#N/A"}},{"$error":"#N/A"}]
[{"$nulls":6},115,{"$f":"IF(Normalverteilung!E123=\"#NV\",\"\",Normalverteilung!E123)","v":{"$error":"#N/A"}},{"$error":"#N/A"}]
[{"$nulls":6},116,{"$f":"IF(Normalverteilung!E124=\"#NV\",\"\",Normalverteilung!E124)","v":{"$error":"#N/A"}},{"$error":"#N/A"}]
[{"$nulls":6},117,{"$f":"IF(Normalverteilung!E125=\"#NV\",\"\",Normalverteilung!E125)","v":{"$error":"#N/A"}},{"$error":"#N/A"}]
[{"$nulls":6},118,{"$f":"IF(Normalverteilung!E126=\"#NV\",\"\",Normalverteilung!E126)","v":{"$error":"#N/A"}},{"$error":"#N/A"}]
[{"$nulls":6},119,{"$f":"IF(Normalverteilung!E127=\"#NV\",\"\",Normalverteilung!E127)","v":{"$error":"#N/A"}},{"$error":"#N/A"}]
[{"$nulls":6},120,{"$f":"IF(Normalverteilung!E128=\"#NV\",\"\",Normalverteilung!E128)","v":{"$error":"#N/A"}},{"$error":"#N/A"}]
[{"$nulls":6},121,{"$f":"IF(Normalverteilung!E129=\"#NV\",\"\",Normalverteilung!E129)","v":{"$error":"#N/A"}},{"$error":"#N/A"}]
[{"$nulls":6},122,{"$f":"IF(Normalverteilung!E130=\"#NV\",\"\",Normalverteilung!E130)","v":{"$error":"#N/A"}},{"$error":"#N/A"}]
[{"$nulls":6},123,{"$f":"IF(Normalverteilung!E131=\"#NV\",\"\",Normalverteilung!E131)","v":{"$error":"#N/A"}},{"$error":"#N/A"}]
[{"$nulls":6},124,{"$f":"IF(Normalverteilung!E132=\"#NV\",\"\",Normalverteilung!E132)","v":{"$error":"#N/A"}},{"$error":"#N/A"}]
[{"$nulls":6},125,{"$f":"IF(Normalverteilung!E133=\"#NV\",\"\",Normalverteilung!E133)","v":{"$error":"#N/A"}},{"$error":"#N/A"}]
[{"$nulls":6},126,{"$f":"IF(Normalverteilung!E134=\"#NV\",\"\",Normalverteilung!E134)","v":{"$error":"#N/A"}},{"$error":"#N/A"}]
[{"$nulls":6},127,{"$f":"IF(Normalverteilung!E135=\"#NV\",\"\",Normalverteilung!E135)","v":{"$error":"#N/A"}},{"$error":"#N/A"}]
[{"$nulls":6},128,{"$f":"IF(Normalverteilung!E136=\"#NV\",\"\",Normalverteilung!E136)","v":{"$error":"#N/A"}},{"$error":"#N/A"}]
[{"$nulls":6},129,{"$f":"IF(Normalverteilung!E137=\"#NV\",\"\",Normalverteilung!E137)","v":{"$error":"#N/A"}},{"$error":"#N/A"}]
[{"$nulls":6},130,{"$f":"IF(Normalverteilung!E138=\"#NV\",\"\",Normalverteilung!E138)","v":{"$error":"#N/A"}},{"$f":"_xlfn.NORM.DIST(H140,$B$2,$B$3,FALSE)*$B$1","v":{"$error":"#N/A"}}]
[{"$nulls":6},131,{"$f":"IF(Normalverteilung!E139=\"#NV\",\"\",Normalverteilung!E139)","v":{"$error":"#N/A"}},{"$error":"#N/A"}]
[{"$nulls":6},132,{"$f":"IF(Normalverteilung!E140=\"#NV\",\"\",Normalverteilung!E140)","v":{"$error":"#N/A"}},{"$error":"#N/A"}]
[{"$nulls":6},133,{"$f":"IF(Normalverteilung!E141=\"#NV\",\"\",Normalverteilung!E141)","v":{"$error":"#N/A"}},{"$error":"#N/A"}]
[{"$nulls":6},134,{"$f":"IF(Normalverteilung!E142=\"#NV\",\"\",Normalverteilung!E142)","v":{"$error":"#N/A"}},{"$error":"#N/A"}]
[{"$nulls":6},135,{"$f":"IF(Normalverteilung!E143=\"#NV\",\"\",Normalverteilung!E143)","v":{"$error":"#N/A"}},{"$error":"#N/A"}]
[{"$nulls":6},136,{"$f":"IF(Normalverteilung!E144=\"#NV\",\"\",Normalverteilung!E144)","v":{"$error":"#N/A"}},{"$error":"#N/A"}]
[{"$nulls":6},137,{"$f":"IF(Normalverteilung!E145=\"#NV\",\"\",Normalverteilung!E145)","v":{"$error":"#N/A"}},{"$error":"#N/A"}]
[{"$nulls":6},138,{"$f":"IF(Normalverteilung!E146=\"#NV\",\"\",Normalverteilung!E146)","v":{"$error":"#N/A"}},{"$error":"#N/A"}]
[{"$nulls":6},139,{"$f":"IF(Normalverteilung!E147=\"#NV\",\"\",Normalverteilung!E147)","v":{"$error":"#N/A"}},{"$error":"#N/A"}]
[{"$nulls":6},140,{"$f":"IF(Normalverteilung!E148=\"#NV\",\"\",Normalverteilung!E148)","v":{"$error":"#N/A"}},{"$error":"#N/A"}]
[{"$nulls":6},141,{"$f":"IF(Normalverteilung!E149=\"#NV\",\"\",Normalverteilung!E149)","v":{"$error":"#N/A"}},{"$error":"#N/A"}]
[{"$nulls":6},142,{"$f":"IF(Normalverteilung!E150=\"#NV\",\"\",Normalverteilung!E150)","v":{"$error":"#N/A"}},{"$error":"#N/A"}]
[{"$nulls":6},143,{"$f":"IF(Normalverteilung!E151=\"#NV\",\"\",Normalverteilung!E151)","v":{"$error":"#N/A"}},{"$error":"#N/A"}]
[{"$nulls":6},144,{"$f":"IF(Normalverteilung!E152=\"#NV\",\"\",Normalverteilung!E152)","v":{"$error":"#N/A"}},{"$error":"#N/A"}]
[{"$nulls":6},145,{"$f":"IF(Normalverteilung!E153=\"#NV\",\"\",Normalverteilung!E153)","v":{"$error":"#N/A"}},{"$error":"#N/A"}]
[{"$nulls":6},146,{"$f":"IF(Normalverteilung!E154=\"#NV\",\"\",Normalverteilung!E154)","v":{"$error":"#N/A"}},{"$error":"#N/A"}]
[{"$nulls":6},147,{"$f":"IF(Normalverteilung!E155=\"#NV\",\"\",Normalverteilung!E155)","v":{"$error":"#N/A"}},{"$error":"#N/A"}]
[{"$nulls":6},148,{"$f":"IF(Normalverteilung!E156=\"#NV\",\"\",Normalverteilung!E156)","v":{"$error":"#N/A"}},{"$error":"#N/A"}]
[{"$nulls":6},149,{"$f":"IF(Normalverteilung!E157=\"#NV\",\"\",Normalverteilung!E157)","v":{"$error":"#N/A"}},{"$error":"#N/A"}]
[{"$nulls":6},150,{"$f":"IF(Normalverteilung!E158=\"#NV\",\"\",Normalverteilung!E158)","v":{"$error":"#N/A"}},{"$error":"#N/A"}]
[{"$nulls":6},151,{"$f":"IF(Normalverteilung!E159=\"#NV\",\"\",Normalverteilung!E159)","v":{"$error":"#N/A"}},{"$error":"#N/A"}]
[{"$nulls":6},152,{"$f":"IF(Normalverteilung!E160=\"#NV\",\"\",Normalverteilung!E160)","v":{"$error":"#N/A"}},{"$error":"#N/A"}]
[{"$nulls":6},153,{"$f":"IF(Normalverteilung!E161=\"#NV\",\"\",Normalverteilung!E161)","v":{"$error":"#N/A"}},{"$error":"#N/A"}]
[{"$nulls":6},154,{"$f":"IF(Normalverteilung!E162=\"#NV\",\"\",Normalverteilung!E162)","v":{"$error":"#N/A"}},{"$error":"#N/A"}]
[{"$nulls":6},155,{"$f":"IF(Normalverteilung!E163=\"#NV\",\"\",Normalverteilung!E163)","v":{"$error":"#N/A"}},{"$error":"#N/A"}]
[{"$nulls":6},156,{"$f":"IF(Normalverteilung!E164=\"#NV\",\"\",Normalverteilung!E164)","v":{"$error":"#N/A"}},{"$error":"#N/A"}]
[{"$nulls":6},157,{"$f":"IF(Normalverteilung!E165=\"#NV\",\"\",Normalverteilung!E165)","v":{"$error":"#N/A"}},{"$error":"#N/A"}]
[{"$nulls":6},158,{"$f":"IF(Normalverteilung!E166=\"#NV\",\"\",Normalverteilung!E166)","v":{"$error":"#N/A"}},{"$error":"#N/A"}]
[{"$nulls":6},159,{"$f":"IF(Normalverteilung!E167=\"#NV\",\"\",Normalverteilung!E167)","v":{"$error":"#N/A"}},{"$error":"#N/A"}]
[{"$nulls":6},160,{"$f":"IF(Normalverteilung!E168=\"#NV\",\"\",Normalverteilung!E168)","v":{"$error":"#N/A"}},{"$error":"#N/A"}]
[{"$nulls":6},161,{"$f":"IF(Normalverteilung!E169=\"#NV\",\"\",Normalverteilung!E169)","v":{"$error":"#N/A"}},{"$error":"#N/A"}]
[{"$nulls":6},162,{"$f":"IF(Normalverteilung!E170=\"#NV\",\"\",Normalverteilung!E170)","v":{"$error":"#N/A"}},{"$error":"#N/A"}]
[{"$nulls":6},163,{"$f":"IF(Normalverteilung!E171=\"#NV\",\"\",Normalverteilung!E171)","v":{"$error":"#N/A"}},{"$error":"#N/A"}]
[{"$nulls":6},164,{"$f":"IF(Normalverteilung!E172=\"#NV\",\"\",Normalverteilung!E172)","v":{"$error":"#N/A"}},{"$error":"#N/A"}]
[{"$nulls":6},165,{"$f":"IF(Normalverteilung!E173=\"#NV\",\"\",Normalverteilung!E173)","v":{"$error":"#N/A"}},{"$error":"#N/A"}]
[{"$nulls":6},166,{"$f":"IF(Normalverteilung!E174=\"#NV\",\"\",Normalverteilung!E174)","v":{"$error":"#N/A"}},{"$error":"#N/A"}]
[{"$nulls":6},167,{"$f":"IF(Normalverteilung!E175=\"#NV\",\"\",Normalverteilung!E175)","v":{"$error":"#N/A"}},{"$error":"#N/A"}]
[{"$nulls":6},168,{"$f":"IF(Normalverteilung!E176=\"#NV\",\"\",Normalverteilung!E176)","v":{"$error":"#N/A"}},{"$error":"#N/A"}]
[{"$nulls":6},169,{"$f":"IF(Normalverteilung!E177=\"#NV\",\"\",Normalverteilung!E177)","v":{"$error":"#N/A"}},{"$error":"#N/A"}]
[{"$nulls":6},170,{"$f":"IF(Normalverteilung!E178=\"#NV\",\"\",Normalverteilung!E178)","v":{"$error":"#N/A"}},{"$error":"#N/A"}]
[{"$nulls":6},171,{"$f":"IF(Normalverteilung!E179=\"#NV\",\"\",Normalverteilung!E179)","v":{"$error":"#N/A"}},{"$error":"#N/A"}]
[{"$nulls":6},172,{"$f":"IF(Normalverteilung!E180=\"#NV\",\"\",Normalverteilung!E180)","v":{"$error":"#N/A"}},{"$error":"#N/A"}]
[{"$nulls":6},173,{"$f":"IF(Normalverteilung!E181=\"#NV\",\"\",Normalverteilung!E181)","v":{"$error":"#N/A"}},{"$error":"#N/A"}]
[{"$nulls":6},174,{"$f":"IF(Normalverteilung!E182=\"#NV\",\"\",Normalverteilung!E182)","v":{"$error":"#N/A"}},{"$error":"#N/A"}]
[{"$nulls":6},175,{"$f":"IF(Normalverteilung!E183=\"#NV\",\"\",Normalverteilung!E183)","v":{"$error":"#N/A"}},{"$error":"#N/A"}]
[{"$nulls":6},176,{"$f":"IF(Normalverteilung!E184=\"#NV\",\"\",Normalverteilung!E184)","v":{"$error":"#N/A"}},{"$error":"#N/A"}]
[{"$nulls":6},177,{"$f":"IF(Normalverteilung!E185=\"#NV\",\"\",Normalverteilung!E185)","v":{"$error":"#N/A"}},{"$error":"#N/A"}]
[{"$nulls":6},178,{"$f":"IF(Normalverteilung!E186=\"#NV\",\"\",Normalverteilung!E186)","v":{"$error":"#N/A"}},{"$error":"#N/A"}]
[{"$nulls":6},179,{"$f":"IF(Normalverteilung!E187=\"#NV\",\"\",Normalverteilung!E187)","v":{"$error":"#N/A"}},{"$error":"#N/A"}]
[{"$nulls":6},180,{"$f":"IF(Normalverteilung!E188=\"#NV\",\"\",Normalverteilung!E188)","v":{"$error":"#N/A"}},{"$error":"#N/A"}]
[{"$nulls":6},181,{"$f":"IF(Normalverteilung!E189=\"#NV\",\"\",Normalverteilung!E189)","v":{"$error":"#N/A"}},{"$error":"#N/A"}]
[{"$nulls":6},182,{"$f":"IF(Normalverteilung!E190=\"#NV\",\"\",Normalverteilung!E190)","v":{"$error":"#N/A"}},{"$error":"#N/A"}]
[{"$nulls":6},183,{"$f":"IF(Normalverteilung!E191=\"#NV\",\"\",Normalverteilung!E191)","v":{"$error":"#N/A"}},{"$error":"#N/A"}]
[{"$nulls":6},184,{"$f":"IF(Normalverteilung!E192=\"#NV\",\"\",Normalverteilung!E192)","v":{"$error":"#N/A"}},{"$error":"#N/A"}]
[{"$nulls":6},185,{"$f":"IF(Normalverteilung!E193=\"#NV\",\"\",Normalverteilung!E193)","v":{"$error":"#N/A"}},{"$error":"#N/A"}]
[{"$nulls":6},186,{"$f":"IF(Normalverteilung!E194=\"#NV\",\"\",Normalverteilung!E194)","v":{"$error":"#N/A"}},{"$error":"#N/A"}]
[{"$nulls":6},187,{"$f":"IF(Normalverteilung!E195=\"#NV\",\"\",Normalverteilung!E195)","v":{"$error":"#N/A"}},{"$error":"#N/A"}]
[{"$nulls":6},188,{"$f":"IF(Normalverteilung!E196=\"#NV\",\"\",Normalverteilung!E196)","v":{"$error":"#N/A"}},{"$error":"#N/A"}]
[{"$nulls":6},189,{"$f":"IF(Normalverteilung!E197=\"#NV\",\"\",Normalverteilung!E197)","v":{"$error":"#N/A"}},{"$error":"#N/A"}]
[{"$nulls":6},190,{"$f":"IF(Normalverteilung!E198=\"#NV\",\"\",Normalverteilung!E198)","v":{"$error":"#N/A"}},{"$error":"#N/A"}]
[{"$nulls":6},191,{"$f":"IF(Normalverteilung!E199=\"#NV\",\"\",Normalverteilung!E199)","v":{"$error":"#N/A"}},{"$error":"#N/A"}]
[{"$nulls":6},192,{"$f":"IF(Normalverteilung!E200=\"#NV\",\"\",Normalverteilung!E200)","v":{"$error":"#N/A"}},{"$error":"#N/A"}]
[{"$nulls":6},193,{"$f":"IF(Normalverteilung!E201=\"#NV\",\"\",Normalverteilung!E201)","v":{"$error":"#N/A"}},{"$error":"#N/A"}]
[{"$nulls":6},194,{"$f":"IF(Normalverteilung!E202=\"#NV\",\"\",Normalverteilung!E202)","v":{"$error":"#N/A"}},{"$f":"_xlfn.NORM.DIST(H204,$B$2,$B$3,FALSE)*$B$1","v":{"$error":"#N/A"}}]
[{"$nulls":6},195,{"$f":"IF(Normalverteilung!E203=\"#NV\",\"\",Normalverteilung!E203)","v":{"$error":"#N/A"}},{"$error":"#N/A"}]
[{"$nulls":6},196,{"$f":"IF(Normalverteilung!E204=\"#NV\",\"\",Normalverteilung!E204)","v":{"$error":"#N/A"}},{"$error":"#N/A"}]
[{"$nulls":6},197,{"$f":"IF(Normalverteilung!E205=\"#NV\",\"\",Normalverteilung!E205)","v":{"$error":"#N/A"}},{"$error":"#N/A"}]
[{"$nulls":6},198,{"$f":"IF(Normalverteilung!E206=\"#NV\",\"\",Normalverteilung!E206)","v":{"$error":"#N/A"}},{"$error":"#N/A"}]
[{"$nulls":6},199,{"$f":"IF(Normalverteilung!E207=\"#NV\",\"\",Normalverteilung!E207)","v":{"$error":"#N/A"}},{"$error":"#N/A"}]
[{"$nulls":6},200,{"$f":"IF(Normalverteilung!E208=\"#NV\",\"\",Normalverteilung!E208)","v":{"$error":"#N/A"}},{"$error":"#N/A"}]
[{"$nulls":6},201,{"$f":"IF(Normalverteilung!E209=\"#NV\",\"\",Normalverteilung!E209)","v":{"$error":"#N/A"}},{"$error":"#N/A"}]
[{"$nulls":6},202,{"$f":"IF(Normalverteilung!E210=\"#NV\",\"\",Normalverteilung!E210)","v":{"$error":"#N/A"}},{"$error":"#N/A"}]
[{"$nulls":6},203,{"$f":"IF(Normalverteilung!E211=\"#NV\",\"\",Normalverteilung!E211)","v":{"$error":"#N/A"}},{"$error":"#N/A"}]
[{"$nulls":6},204,{"$f":"IF(Normalverteilung!E212=\"#NV\",\"\",Normalverteilung!E212)","v":{"$error":"#N/A"}},{"$error":"#N/A"}]
[{"$nulls":6},205,{"$f":"IF(Normalverteilung!E213=\"#NV\",\"\",Normalverteilung!E213)","v":{"$error":"#N/A"}},{"$error":"#N/A"}]
[{"$nulls":6},206,{"$f":"IF(Normalverteilung!E214=\"#NV\",\"\",Normalverteilung!E214)","v":{"$error":"#N/A"}},{"$error":"#N/A"}]
[{"$nulls":6},207,{"$f":"IF(Normalverteilung!E215=\"#NV\",\"\",Normalverteilung!E215)","v":{"$error":"#N/A"}},{"$error":"#N/A"}]
[{"$nulls":6},208,{"$f":"IF(Normalverteilung!E216=\"#NV\",\"\",Normalverteilung!E216)","v":{"$error":"#N/A"}},{"$error":"#N/A"}]
[{"$nulls":6},209,{"$f":"IF(Normalverteilung!E217=\"#NV\",\"\",Normalverteilung!E217)","v":{"$error":"#N/A"}},{"$error":"#N/A"}]
[{"$nulls":6},210,{"$f":"IF(Normalverteilung!E218=\"#NV\",\"\",Normalverteilung!E218)","v":{"$error":"#N/A"}},{"$error":"#N/A"}]
[{"$nulls":6},211,{"$f":"IF(Normalverteilung!E219=\"#NV\",\"\",Normalverteilung!E219)","v":{"$error":"#N/A"}},{"$error":"#N/A"}]
[{"$nulls":6},212,{"$f":"IF(Normalverteilung!E220=\"#NV\",\"\",Normalverteilung!E220)","v":{"$error":"#N/A"}},{"$error":"#N/A"}]
[{"$nulls":6},213,{"$f":"IF(Normalverteilung!E221=\"#NV\",\"\",Normalverteilung!E221)","v":{"$error":"#N/A"}},{"$error":"#N/A"}]
[{"$nulls":6},214,{"$f":"IF(Normalverteilung!E222=\"#NV\",\"\",Normalverteilung!E222)","v":{"$error":"#N/A"}},{"$error":"#N/A"}]
[{"$nulls":6},215,{"$f":"IF(Normalverteilung!E223=\"#NV\",\"\",Normalverteilung!E223)","v":{"$error":"#N/A"}},{"$error":"#N/A"}]
[{"$nulls":6},216,{"$f":"IF(Normalverteilung!E224=\"#NV\",\"\",Normalverteilung!E224)","v":{"$error":"#N/A"}},{"$error":"#N/A"}]

{"sheet":"Normalverteilung","index":3,"n_rows":224,"n_cols":22,"rows_kept":224,"hidden":true,"merged":[[1,1,1,2],[2,1,2,2],[3,1,3,2],[4,1,4,2],[5,1,5,2],[5,16,5,21]]}
[]
[null,"Anzahl",null,null,{"$f":"Fähigkeitsnachweis!C27","v":0},null,"p1",{"$f":"IF((K4>=0.6),EXP(1.2937-5.709*K4+0.0186*K4^ 2),0)","v":{"$error":"#N/A"}},null,"S",{"$f":"SUM(J9:J224)","v":{"$error":"#N/A"}}]
[null,"Mittelwert",null,null,{"$f":"Fähigkeitsnachweis!C29","v":""},null,"p2",{"$f":"IF(AND(K4<0.6,K4>=0.34),EXP(0.9177-4.279*K4-1.38*K4^2),0)","v":{"$error":"#N/A"}},null,"AD",{"$f":"-K2/E2-E2","v":{"$error":"#N/A"}}]
[null,"Standartabweichung",null,null,{"$f":"Fähigkeitsnachweis!C31","v":""},null,"p3",{"$f":"IF(AND(K4<0.34,K4>=0.2),1-EXP(-8.318+42.796*K4-59.938*K4^2),0)","v":{"$error":"#N/A"}},null,"z",{"$f":"K3*(1+0.75/E2+2.25/E2^2)","v":{"$error":"#N/A"}}]
[null,"Minumum",null,null,{"$f":"MIN(C9:C224)","v":{"$error":"#N/A"}},null,"p4",{"$f":"IF(K4<0.2,1-EXP(-13.436+101.14*K4-223.73*K4^2),0)","v":{"$error":"#N/A"}},null,"p - Wert",{"$f":"MAX(H2:H5)","v":{"$error":"#N/A"}}]
[null,"Maximum",null,null,{"$f":"MAX(C9:C224)","v":{"$error":"#N/A"}},{"$nulls":11},"Diagramm Chronologische Stochprobe"]
[{"$nulls":16}," Mittelwert",null,"UGW","OGW","- 3 Sigma","+ 3 Sigma"]
["Zähler","Zähler mit leer","xi","xi mit #NV","xi sortiert","Zähler","A","B","C","S","z",null,null,"Wert","z",null,"Wert y","Wert x","Wert y ","Wert y","Wert y","Wert y"]
[1,{"$f":"_xlfn.IFNA(IF(C9=\"\",#N/A,A9),\"\")","v":""},{"$f":"IF(Messergebnisse!B2=\"\",#N/A,Messergebnisse!B2)","v":{"$error":"#N/A"}},{"$f":"IF(C9=\"\",#N/A,C9)","v":{"$error":"#N/A"}},{"$f":"IF(C9=\"\",#N/A,SMALL(C$9:C$224,F9))","v":{"$error":"#N/A"}},{"$f":"IF(C9=\"\",\"\",1)","v":{"$error":"#N/A"}},{"$f":"IF(IF(C9=\"\",\"\",NORMSDIST((E9-$E$3)/$E$4))=1,0.999999999,IF(C9=\"\",\"\",NORMSDIST((E9-$E$3)/$E$4)))","v":{"$error":"#N/A"}},{"$f":"IF(C9=\"\",\"\",1-G9)","v":{"$error":"#N/A"}},{"$f":"IF(C9=\"\",\"\",SMALL(H$9:H$224,F9))","v":{"$error":"#N/A"}},{"$f":"IF(C9=\"\",\"\",(2*F9-1)*(LN(I9)+LN(G9)))","v":{"$error":"#N/A"}},{"$f":"IF(C9=\"\",#N/A,NORMSINV((F9-0.3)/($E$2+0.4)))","v":{"$error":"#N/A"}},null,null,{"$f":"O9*E4+E3","v":{"$error":"#VALUE!"}},-3,null,{"$f":"$E$3","v":""},{"$f":"MIN($B$9:$B$224)","v":0},{"$f":"Fähigkeitsnachweis!$C$14","v":0},{"$f":"Fähigkeitsnachweis!$G$14","v":0},{"$f":"Fähigkeitsnachweis!$C$29-(3*Fähigkeitsnachweis!$C$31)","v":{"$error":"#VALUE!"}},{"$f":"Fähigkeitsnachweis!$C$29+(3*Fähigkeitsnachweis!$C$31)","v":{"$error":"#VALUE!"}}]
[2,"",{"$f":"IF(Messergebnisse!B3=\"\",\"\",Messergebnisse!B3)","v":""},{"$f":"IF(C10=\"\",#N/A,C10)","v":{"$error":"#N/A"}},{"$f":"IF(C10=\"\",#N/A,SMALL(C$9:C$224,F10))","v":{"$error":"#N/A"}},{"$f":"IF(C10=\"\",\"\",F9+1)","v":""},{"$f":"IF(IF(C10=\"\",\"\",NORMSDIST((E10-$E$3)/$E$4))=1,0.999999999,IF(C10=\"\",\"\",NORMSDIST((E10-$E$3)/$E$4)))","v":""},{"$f":"IF(C10=\"\",\"\",1-G10)","v":""},{"$f":"IF(C10=\"\",\"\",SMALL(H$9:H$224,F10))","v":""},"",{"$f":"IF(C10=\"\",#N/A,NORMSINV((F10-0.3)/($E$2+0.4)))","v":{"$error":"#N/A"}},null,null,{"$f":"E3","v":""},0,null,{"$f":"$E$3","v":""},{"$f":"MAX($B$9:$B$224)","v":0},{"$f":"Fähigkeitsnachweis!$C$14","v":0},{"$f":"Fähigkeitsnachweis!$G$14","v":0},{"$f":"Fähigkeitsnachweis!$C$29-(3*Fähigkeitsnachweis!$C$31)","v":{"$error":"#VALUE!"}},{"$f":"Fähigkeitsnachweis!$C$29+(3*Fähigkeitsnachweis!$C$31)","v":{"$error":"#VALUE!"}}]
[3,"",{"$f":"IF(Messergebnisse!B4=\"\",\"\",Messergebnisse!B4)","v":""},{"$error":"#N/A"},{"$error":"#N/A"},{"$f":"IF(C11=\"\",\"\",F10+1)","v":""},"","","","",{"$error":"#N/A"},null,null,{"$f":"O11*E4+E3","v":{"$error":"#VALUE!"}},3]
[4,"",{"$f":"IF(Messergebnisse!B5=\"\",\"\",Messergebnisse!B5)","v":""},{"$error":"#N/A"},{"$error":"#N/A"},"","","","","",{"$error":"#N/A"}]
[5,"",{"$f":"IF(Messergebnisse!B6=\"\",\"\",Messergebnisse!B6)","v":""},{"$error":"#N/A"},{"$error":"#N/A"},"","","","","",{"$error":"#N/A"}]
[6,"",{"$f":"IF(Messergebnisse!B7=\"\",\"\",Messergebnisse!B7)","v":""},{"$error":"#N/A"},{"$error":"#N/A"},"","","","","",{"$error":"#N/A"}]
[7,"",{"$f":"IF(Messergebnisse!B8=\"\",\"\",Messergebnisse!B8)","v":""},{"$error":"#N/A"},{"$error":"#N/A"},"","","","","",{"$error":"#N/A"}]
[8,"",{"$f":"IF(Messergebnisse!B9=\"\",\"\",Messergebnisse!B9)","v":""},{"$error":"#N/A"},{"$error":"#N/A"},"","","","","",{"$error":"#N/A"}]
[9,"",{"$f":"IF(Messergebnisse!B10=\"\",\"\",Messergebnisse!B10)","v":""},{"$error":"#N/A"},{"$error":"#N/A"},"","","","","",{"$error":"#N/A"}]
[10,"",{"$f":"IF(Messergebnisse!B11=\"\",\"\",Messergebnisse!B11)","v":""},{"$error":"#N/A"},{"$error":"#N/A"},"","","","","",{"$error":"#N/A"}]
[11,"",{"$f":"IF(Messergebnisse!B12=\"\",\"\",Messergebnisse!B12)","v":""},{"$error":"#N/A"},{"$error":"#N/A"},"","","","","",{"$error":"#N/A"}]
[12,"",{"$f":"IF(Messergebnisse!B13=\"\",\"\",Messergebnisse!B13)","v":""},{"$error":"#N/A"},{"$error":"#N/A"},"","","","","",{"$error":"#N/A"}]
[13,"",{"$f":"IF(Messergebnisse!B14=\"\",\"\",Messergebnisse!B14)","v":""},{"$error":"#N/A"},{"$error":"#N/A"},"","","","","",{"$error":"#N/A"}]
[14,"",{"$f":"IF(Messergebnisse!B15=\"\",\"\",Messergebnisse!B15)","v":""},{"$error":"#N/A"},{"$error":"#N/A"},"","","","","",{"$error":"#N/A"}]
[15,"",{"$f":"IF(Messergebnisse!B16=\"\",\"\",Messergebnisse!B16)","v":""},{"$error":"#N/A"},{"$error":"#N/A"},"","","","","",{"$error":"#N/A"}]
[16,"",{"$f":"IF(Messergebnisse!B17=\"\",\"\",Messergebnisse!B17)","v":""},{"$error":"#N/A"},{"$error":"#N/A"},"","","","","",{"$error":"#N/A"}]
[17,"",{"$f":"IF(Messergebnisse!B18=\"\",\"\",Messergebnisse!B18)","v":""},{"$error":"#N/A"},{"$error":"#N/A"},"","","","","",{"$error":"#N/A"}]
[18,"",{"$f":"IF(Messergebnisse!B19=\"\",\"\",Messergebnisse!B19)","v":""},{"$error":"#N/A"},{"$error":"#N/A"},"","","","","",{"$error":"#N/A"}]
[19,"",{"$f":"IF(Messergebnisse!B20=\"\",\"\",Messergebnisse!B20)","v":""},{"$error":"#N/A"},{"$error":"#N/A"},"","","","","",{"$error":"#N/A"}]
[20,"",{"$f":"IF(Messergebnisse!B21=\"\",\"\",Messergebnisse!B21)","v":""},{"$error":"#N/A"},{"$error":"#N/A"},"","","","","",{"$error":"#N/A"}]
[21,"",{"$f":"IF(Messergebnisse!B22=\"\",\"\",Messergebnisse!B22)","v":""},{"$error":"#N/A"},{"$error":"#N/A"},"","","","","",{"$error":"#N/A"}]
[22,"",{"$f":"IF(Messergebnisse!B23=\"\",\"\",Messergebnisse!B23)","v":""},{"$error":"#N/A"},{"$error":"#N/A"},"","","","","",{"$error":"#N/A"}]
[23,"",{"$f":"IF(Messergebnisse!B24=\"\",\"\",Messergebnisse!B24)","v":""},{"$error":"#N/A"},{"$error":"#N/A"},"","","","","",{"$error":"#N/A"}]
[24,"",{"$f":"IF(Messergebnisse!B25=\"\",\"\",Messergebnisse!B25)","v":""},{"$error":"#N/A"},{"$error":"#N/A"},"","","","","",{"$error":"#N/A"}]
[25,"",{"$f":"IF(Messergebnisse!B26=\"\",\"\",Messergebnisse!B26)","v":""},{"$error":"#N/A"},{"$error":"#N/A"},"","","","","",{"$error":"#N/A"}]
[26,"",{"$f":"IF(Messergebnisse!B27=\"\",\"\",Messergebnisse!B27)","v":""},{"$error":"#N/A"},{"$error":"#N/A"},"","","","","",{"$error":"#N/A"}]
[27,"",{"$f":"IF(Messergebnisse!B28=\"\",\"\",Messergebnisse!B28)","v":""},{"$error":"#N/A"},{"$error":"#N/A"},"","","","","",{"$error":"#N/A"}]
[28,"",{"$f":"IF(Messergebnisse!B29=\"\",\"\",Messergebnisse!B29)","v":""},{"$error":"#N/A"},{"$error":"#N/A"},"","","","","",{"$error":"#N/A"}]
[29,"",{"$f":"IF(Messergebnisse!B30=\"\",\"\",Messergebnisse!B30)","v":""},{"$error":"#N/A"},{"$error":"#N/A"},"","","","","",{"$error":"#N/A"}]
[30,"",{"$f":"IF(Messergebnisse!B31=\"\",\"\",Messergebnisse!B31)","v":""},{"$error":"#N/A"},{"$error":"#N/A"},"","","","","",{"$error":"#N/A"}]
[31,"",{"$f":"IF(Messergebnisse!B32=\"\",\"\",Messergebnisse!B32)","v":""},{"$error":"#N/A"},{"$error":"#N/A"},"","","","","",{"$error":"#N/A"}]
[32,"",{"$f":"IF(Messergebnisse!B33=\"\",\"\",Messergebnisse!B33)","v":""},{"$error":"#N/A"},{"$error":"#N/A"},"","","","","",{"$error":"#N/A"}]
[33,"",{"$f":"IF(Messergebnisse!B34=\"\",\"\",Messergebnisse!B34)","v":""},{"$error":"#N/A"},{"$error":"#N/A"},"","","","","",{"$error":"#N/A"}]
[34,"",{"$f":"IF(Messergebnisse!B35=\"\",\"\",Messergebnisse!B35)","v":""},{"$error":"#N/A"},{"$error":"#N/A"},"","","","","",{"$error":"#N/A"}]
[35,"",{"$f":"IF(Messergebnisse!B36=\"\",\"\",Messergebnisse!B36)","v":""},{"$error":"#N/A"},{"$error":"#N/A"},"","","","","",{"$error":"#N/A"}]
[36,"",{"$f":"IF(Messergebnisse!B37=\"\",\"\",Messergebnisse!B37)","v":""},{"$error":"#N/A"},{"$error":"#N/A"},"","","","","",{"$error":"#N/A"}]
[37,"",{"$f":"IF(Messergebnisse!B38=\"\",\"\",Messergebnisse!B38)","v":""},{"$error":"#N/A"},{"$error":"#N/A"},"","","","","",{"$error":"#N/A"}]
[38,"",{"$f":"IF(Messergebnisse!B39=\"\",\"\",Messergebnisse!B39)","v":""},{"$error":"#N/A"},{"$error":"#N/A"},"","","","","",{"$error":"#N/A"}]
[39,"",{"$f":"IF(Messergebnisse!B40=\"\",\"\",Messergebnisse!B40)","v":""},{"$error":"#N/A"},{"$error":"#N/A"},"","","","","",{"$error":"#N/A"}]
[40,"",{"$f":"IF(Messergebnisse!B41=\"\",\"\",Messergebnisse!B41)","v":""},{"$error":"#N/A"},{"$error":"#N/A"},"","","","","",{"$error":"#N/A"}]
[41,"",{"$f":"IF(Messergebnisse!B42=\"\",\"\",Messergebnisse!B42)","v":""},{"$error":"#N/A"},{"$error":"#N/A"},"","","","","",{"$error":"#N/A"}]
[42,"",{"$f":"IF(Messergebnisse!B43=\"\",\"\",Messergebnisse!B43)","v":""},{"$error":"#N/A"},{"$error":"#N/A"},"","","","","",{"$error":"#N/A"}]
[43,"",{"$f":"IF(Messergebnisse!B44=\"\",\"\",Messergebnisse!B44)","v":""},{"$error":"#N/A"},{"$error":"#N/A"},"","","","","",{"$error":"#N/A"}]
[44,"",{"$f":"IF(Messergebnisse!B45=\"\",\"\",Messergebnisse!B45)","v":""},{"$error":"#N/A"},{"$error":"#N/A"},"","","","","",{"$error":"#N/A"}]
[45,"",{"$f":"IF(Messergebnisse!B46=\"\",\"\",Messergebnisse!B46)","v":""},{"$error":"#N/A"},{"$error":"#N/A"},"","","","","",{"$error":"#N/A"}]
[46,"",{"$f":"IF(Messergebnisse!B47=\"\",\"\",Messergebnisse!B47)","v":""},{"$error":"#N/A"},{"$error":"#N/A"},"","","","","",{"$error":"#N/A"}]
[47,"",{"$f":"IF(Messergebnisse!B48=\"\",\"\",Messergebnisse!B48)","v":""},{"$error":"#N/A"},{"$error":"#N/A"},"","","","","",{"$error":"#N/A"}]
[48,"",{"$f":"IF(Messergebnisse!B49=\"\",\"\",Messergebnisse!B49)","v":""},{"$error":"#N/A"},{"$error":"#N/A"},"","","","","",{"$error":"#N/A"}]
[49,"",{"$f":"IF(Messergebnisse!B50=\"\",\"\",Messergebnisse!B50)","v":""},{"$error":"#N/A"},{"$error":"#N/A"},"","","","","",{"$error":"#N/A"}]
[50,"",{"$f":"IF(Messergebnisse!B51=\"\",\"\",Messergebnisse!B51)","v":""},{"$error":"#N/A"},{"$error":"#N/A"},"","","","","",{"$error":"#N/A"}]
[51,"",{"$f":"IF(Messergebnisse!B52=\"\",\"\",Messergebnisse!B52)","v":""},{"$error":"#N/A"},{"$error":"#N/A"},"","","","","",{"$error":"#N/A"}]
[52,"",{"$f":"IF(Messergebnisse!B53=\"\",\"\",Messergebnisse!B53)","v":""},{"$error":"#N/A"},{"$error":"#N/A"},"","","","","",{"$error":"#N/A"}]
[53,"",{"$f":"IF(Messergebnisse!B54=\"\",\"\",Messergebnisse!B54)","v":""},{"$error":"#N/A"},{"$error":"#N/A"},"","","","","",{"$error":"#N/A"}]
[54,"",{"$f":"IF(Messergebnisse!B55=\"\",\"\",Messergebnisse!B55)","v":""},{"$error":"#N/A"},{"$error":"#N/A"},"","","","","",{"$error":"#N/A"}]
[55,"",{"$f":"IF(Messergebnisse!D2=\"\",\"\",Messergebnisse!D2)","v":""},{"$error":"#N/A"},{"$error":"#N/A"},"","","","","",{"$error":"#N/A"}]
[56,"",{"$f":"IF(Messergebnisse!D3=\"\",\"\",Messergebnisse!D3)","v":""},{"$error":"#N/A"},{"$error":"#N/A"},"","","","","",{"$error":"#N/A"}]
[57,"",{"$f":"IF(Messergebnisse!D4=\"\",\"\",Messergebnisse!D4)","v":""},{"$error":"#N/A"},{"$error":"#N/A"},"","","","","",{"$error":"#N/A"}]
[58,"",{"$f":"IF(Messergebnisse!D5=\"\",\"\",Messergebnisse!D5)","v":""},{"$error":"#N/A"},{"$error":"#N/A"},"","","","","",{"$error":"#N/A"}]
[59,"",{"$f":"IF(Messergebnisse!D6=\"\",\"\",Messergebnisse!D6)","v":""},{"$error":"#N/A"},{"$error":"#N/A"},"","","","","",{"$error":"#N/A"}]
[60,"",{"$f":"IF(Messergebnisse!D7=\"\",\"\",Messergebnisse!D7)","v":""},{"$error":"#N/A"},{"$error":"#N/A"},"","","","","",{"$error":"#N/A"}]
[61,"",{"$f":"IF(Messergebnisse!D8=\"\",\"\",Messergebnisse!D8)","v":""},{"$error":"#N/A"},{"$error":"#N/A"},"","","","","",{"$error":"#N/A"}]
[62,"",{"$f":"IF(Messergebnisse!D9=\"\",\"\",Messergebnisse!D9)","v":""},{"$error":"#N/A"},{"$error":"#N/A"},"","","","","",{"$error":"#N/A"}]
[63,"",{"$f":"IF(Messergebnisse!D10=\"\",\"\",Messergebnisse!D10)","v":""},{"$error":"#N/A"},{"$error":"#N/A"},"","","","","",{"$error":"#N/A"}]
[64,"",{"$f":"IF(Messergebnisse!D11=\"\",\"\",Messergebnisse!D11)","v":""},{"$error":"#N/A"},{"$error":"#N/A"},"","","","","",{"$error":"#N/A"}]
[65,{"$f":"_xlfn.IFNA(IF(C73=\"\",#N/A,A73),\"\")","v":""},{"$f":"IF(Messergebnisse!D12=\"\",\"\",Messergebnisse!D12)","v":""},{"$error":"#N/A"},{"$error":"#N/A"},"","","","",{"$f":"IF(C73=\"\",\"\",(2*F73-1)*(LN(I73)+LN(G73)))","v":""},{"$error":"#N/A"}]
[66,"",{"$f":"IF(Messergebnisse!D13=\"\",\"\",Messergebnisse!D13)","v":""},{"$f":"IF(C74=\"\",#N/A,C74)","v":{"$error":"#N/A"}},{"$f":"IF(C74=\"\",#N/A,SMALL(C$9:C$224,F74))","v":{"$error":"#N/A"}},"",{"$f":"IF(IF(C74=\"\",\"\",NORMSDIST((E74-$E$3)/$E$4))=1,0.999999999,IF(C74=\"\",\"\",NORMSDIST((E74-$E$3)/$E$4)))","v":""},{"$f":"IF(C74=\"\",\"\",1-G74)","v":""},{"$f":"IF(C74=\"\",\"\",SMALL(H$9:H$224,F74))","v":""},"",{"$f":"IF(C74=\"\",#N/A,NORMSINV((F74-0.3)/($E$2+0.4)))","v":{"$error":"#N/A"}}]
[67,"",{"$f":"IF(Messergebnisse!D14=\"\",\"\",Messergebnisse!D14)","v":""},{"$error":"#N/A"},{"$error":"#N/A"},{"$f":"IF(C75=\"\",\"\",F74+1)","v":""},"","","","",{"$error":"#N/A"}]
[68,"",{"$f":"IF(Messergebnisse!D15=\"\",\"\",Messergebnisse!D15)","v":""},{"$error":"#N/A"},{"$error":"#N/A"},"","","","","",{"$error":"#N/A"}]
[69,"",{"$f":"IF(Messergebnisse!D16=\"\",\"\",Messergebnisse!D16)","v":""},{"$error":"#N/A"},{"$error":"#N/A"},"","","","","",{"$error":"#N/A"}]
[70,"",{"$f":"IF(Messergebnisse!D17=\"\",\"\",Messergebnisse!D17)","v":""},{"$error":"#N/A"},{"$error":"#N/A"},"","","","","",{"$error":"#N/A"}]
[71,"",{"$f":"IF(Messergebnisse!D18=\"\",\"\",Messergebnisse!D18)","v":""},{"$error":"#N/A"},{"$error":"#N/A"},"","","","","",{"$error":"#N/A"}]
[72,"",{"$f":"IF(Messergebnisse!D19=\"\",\"\",Messergebnisse!D19)","v":""},{"$error":"#N/A"},{"$error":"#N/A"},"","","","","",{"$error":"#N/A"}]
[73,"",{"$f":"IF(Messergebnisse!D20=\"\",\"\",Messergebnisse!D20)","v":""},{"$error":"#N/A"},{"$error":"#N/A"},"","","","","",{"$error":"#N/A"}]
[74,"",{"$f":"IF(Messergebnisse!D21=\"\",\"\",Messergebnisse!D21)","v":""},{"$error":"#N/A"},{"$error":"#N/A"},"","","","","",{"$error":"#N/A"}]
[75,"",{"$f":"IF(Messergebnisse!D22=\"\",\"\",Messergebnisse!D22)","v":""},{"$error":"#N/A"},{"$error":"#N/A"},"","","","","",{"$error":"#N/A"}]
[76,"",{"$f":"IF(Messergebnisse!D23=\"\",\"\",Messergebnisse!D23)","v":""},{"$error":"#N/A"},{"$error":"#N/A"},"","","","","",{"$error":"#N/A"}]
[77,"",{"$f":"IF(Messergebnisse!D24=\"\",\"\",Messergebnisse!D24)","v":""},{"$error":"#N/A"},{"$error":"#N/A"},"","","","","",{"$error":"#N/A"}]
[78,"",{"$f":"IF(Messergebnisse!D25=\"\",\"\",Messergebnisse!D25)","v":""},{"$error":"#N/A"},{"$error":"#N/A"},"","","","","",{"$error":"#N/A"}]
[79,"",{"$f":"IF(Messergebnisse!D26=\"\",\"\",Messergebnisse!D26)","v":""},{"$error":"#N/A"},{"$error":"#N/A"},"","","","","",{"$error":"#N/A"}]
[80,"",{"$f":"IF(Messergebnisse!D27=\"\",\"\",Messergebnisse!D27)","v":""},{"$error":"#N/A"},{"$error":"#N/A"},"","","","","",{"$error":"#N/A"}]
[81,"",{"$f":"IF(Messergebnisse!D28=\"\",\"\",Messergebnisse!D28)","v":""},{"$error":"#N/A"},{"$error":"#N/A"},"","","","","",{"$error":"#N/A"}]
[82,"",{"$f":"IF(Messergebnisse!D29=\"\",\"\",Messergebnisse!D29)","v":""},{"$error":"#N/A"},{"$error":"#N/A"},"","","","","",{"$error":"#N/A"}]
[83,"",{"$f":"IF(Messergebnisse!D30=\"\",\"\",Messergebnisse!D30)","v":""},{"$error":"#N/A"},{"$error":"#N/A"},"","","","","",{"$error":"#N/A"}]
[84,"",{"$f":"IF(Messergebnisse!D31=\"\",\"\",Messergebnisse!D31)","v":""},{"$error":"#N/A"},{"$error":"#N/A"},"","","","","",{"$error":"#N/A"}]
[85,"",{"$f":"IF(Messergebnisse!D32=\"\",\"\",Messergebnisse!D32)","v":""},{"$error":"#N/A"},{"$error":"#N/A"},"","","","","",{"$error":"#N/A"}]
[86,"",{"$f":"IF(Messergebnisse!D33=\"\",\"\",Messergebnisse!D33)","v":""},{"$error":"#N/A"},{"$error":"#N/A"},"","","","","",{"$error":"#N/A"}]
[87,"",{"$f":"IF(Messergebnisse!D34=\"\",\"\",Messergebnisse!D34)","v":""},{"$error":"#N/A"},{"$error":"#N/A"},"","","","","",{"$error":"#N/A"}]
[88,"",{"$f":"IF(Messergebnisse!D35=\"\",\"\",Messergebnisse!D35)","v":""},{"$error":"#N/A"},{"$error":"#N/A"},"","","","","",{"$error":"#N/A"}]
[89,"",{"$f":"IF(Messergebnisse!D36=\"\",\"\",Messergebnisse!D36)","v":""},{"$error":"#N/A"},{"$error":"#N/A"},"","","","","",{"$error":"#N/A"}]
[90,"",{"$f":"IF(Messergebnisse!D37=\"\",\"\",Messergebnisse!D37)","v":""},{"$error":"#N/A"},{"$error":"#N/A"},"","","","","",{"$error":"#N/A"}]
[91,"",{"$f":"IF(Messergebnisse!D38=\"\",\"\",Messergebnisse!D38)","v":""},{"$error":"#N/A"},{"$error":"#N/A"},"","","","","",{"$error":"#N/A"}]
[92,"",{"$f":"IF(Messergebnisse!D39=\"\",\"\",Messergebnisse!D39)","v":""},{"$error":"#N/A"},{"$error":"#N/A"},"","","","","",{"$error":"#N/A"}]
[93,"",{"$f":"IF(Messergebnisse!D40=\"\",\"\",Messergebnisse!D40)","v":""},{"$error":"#N/A"},{"$error":"#N/A"},"","","","","",{"$error":"#N/A"}]
[94,"",{"$f":"IF(Messergebnisse!D41=\"\",\"\",Messergebnisse!D41)","v":""},{"$error":"#N/A"},{"$error":"#N/A"},"","","","","",{"$error":"#N/A"}]
[95,"",{"$f":"IF(Messergebnisse!D42=\"\",\"\",Messergebnisse!D42)","v":""},{"$error":"#N/A"},{"$error":"#N/A"},"","","","","",{"$error":"#N/A"}]
[96,"",{"$f":"IF(Messergebnisse!D43=\"\",\"\",Messergebnisse!D43)","v":""},{"$error":"#N/A"},{"$error":"#N/A"},"","","","","",{"$error":"#N/A"}]
[97,"",{"$f":"IF(Messergebnisse!D44=\"\",\"\",Messergebnisse!D44)","v":""},{"$error":"#N/A"},{"$error":"#N/A"},"","","","","",{"$error":"#N/A"}]
[98,"",{"$f":"IF(Messergebnisse!D45=\"\",\"\",Messergebnisse!D45)","v":""},{"$error":"#N/A"},{"$error":"#N/A"},"","","","","",{"$error":"#N/A"}]
[99,"",{"$f":"IF(Messergebnisse!D46=\"\",\"\",Messergebnisse!D46)","v":""},{"$error":"#N/A"},{"$error":"#N/A"},"","","","","",{"$error":"#N/A"}]
[100,"",{"$f":"IF(Messergebnisse!D47=\"\",\"\",Messergebnisse!D47)","v":""},{"$error":"#N/A"},{"$error":"#N/A"},"","","","","",{"$error":"#N/A"}]
[101,"",{"$f":"IF(Messergebnisse!D48=\"\",\"\",Messergebnisse!D48)","v":""},{"$error":"#N/A"},{"$error":"#N/A"},"","","","","",{"$error":"#N/A"}]
[102,"",{"$f":"IF(Messergebnisse!D49=\"\",\"\",Messergebnisse!D49)","v":""},{"$error":"#N/A"},{"$error":"#N/A"},"","","","","",{"$error":"#N/A"}]
[103,"",{"$f":"IF(Messergebnisse!D50=\"\",\"\",Messergebnisse!D50)","v":""},{"$error":"#N/A"},{"$error":"#N/A"},"","","","","",{"$error":"#N/A"}]
[104,"",{"$f":"IF(Messergebnisse!D51=\"\",\"\",Messergebnisse!D51)","v":""},{"$error":"#N/A"},{"$error":"#N/A"},"","","","","",{"$error":"#N/A"}]
[105,{"$f":"_xlfn.IFNA(IF(C113=\"\",#N/A,A113),\"\")","v":""},{"$f":"IF(Messergebnisse!D52=\"\",\"\",Messergebnisse!D52)","v":""},{"$error":"#N/A"},{"$error":"#N/A"},"","","","","",{"$error":"#N/A"}]
[106,{"$f":"_xlfn.IFNA(IF(C114=\"\",#N/A,A114),\"\")","v":""},{"$f":"IF(Messergebnisse!D53=\"\",\"\",Messergebnisse!D53)","v":""},{"$error":"#N/A"},{"$error":"#N/A"},"","","","","",{"$error":"#N/A"}]
[107,"",{"$f":"IF(Messergebnisse!D54=\"\",\"\",Messergebnisse!D54)","v":""},{"$error":"#N/A"},{"$error":"#N/A"},"","","","","",{"$error":"#N/A"}]
[108,"",{"$f":"IF(Messergebnisse!D55=\"\",\"\",Messergebnisse!D55)","v":""},{"$error":"#N/A"},{"$error":"#N/A"},"","","","","",{"$error":"#N/A"}]
[109,"",{"$f":"IF(Messergebnisse!F2=\"\",\"\",Messergebnisse!F2)","v":""},{"$error":"#N/A"},{"$error":"#N/A"},"","","","","",{"$error":"#N/A"}]
[110,"",{"$f":"IF(Messergebnisse!F3=\"\",\"\",Messergebnisse!F3)","v":""},{"$error":"#N/A"},{"$error":"#N/A"},"","","","","",{"$error":"#N/A"}]
[111,"",{"$f":"IF(Messergebnisse!F4=\"\",\"\",Messergebnisse!F4)","v":""},{"$error":"#N/A"},{"$error":"#N/A"},"","","","","",{"$error":"#N/A"}]
[112,"",{"$f":"IF(Messergebnisse!F5=\"\",\"\",Messergebnisse!F5)","v":""},{"$error":"#N/A"},{"$error":"#N/A"},"","","","","",{"$error":"#N/A"}]
[113,"",{"$f":"IF(Messergebnisse!F6=\"\",\"\",Messergebnisse!F6)","v":""},{"$error":"#N/A"},{"$error":"#N/A"},"","","","","",{"$error":"#N/A"}]
[114,"",{"$f":"IF(Messergebnisse!F7=\"\",\"\",Messergebnisse!F7)","v":""},{"$error":"#N/A"},{"$error":"#N/A"},"","","","","",{"$error":"#N/A"}]
[115,"",{"$f":"IF(Messergebnisse!F8=\"\",\"\",Messergebnisse!F8)","v":""},{"$error":"#N/A"},{"$error":"#N/A"},"","","","","",{"$error":"#N/A"}]
[116,"",{"$f":"IF(Messergebnisse!F9=\"\",\"\",Messergebnisse!F9)","v":""},{"$error":"#N/A"},{"$error":"#N/A"},"","","","","",{"$error":"#N/A"}]
[117,"",{"$f":"IF(Messergebnisse!F10=\"\",\"\",Messergebnisse!F10)","v":""},{"$error":"#N/A"},{"$error":"#N/A"},"","","","","",{"$error":"#N/A"}]
[118,"",{"$f":"IF(Messergebnisse!F11=\"\",\"\",Messergebnisse!F11)","v":""},{"$error":"#N/A"},{"$error":"#N/A"},"","","","","",{"$error":"#N/A"}]
[119,"",{"$f":"IF(Messergebnisse!F12=\"\",\"\",Messergebnisse!F12)","v":""},{"$error":"#N/A"},{"$error":"#N/A"},"","","","","",{"$error":"#N/A"}]
[120,"",{"$f":"IF(Messergebnisse!F13=\"\",\"\",Messergebnisse!F13)","v":""},{"$error":"#N/A"},{"$error":"#N/A"},"","","","","",{"$error":"#N/A"}]
[121,"",{"$f":"IF(Messergebnisse!F14=\"\",\"\",Messergebnisse!F14)","v":""},{"$error":"#N/A"},{"$error":"#N/A"},"","","","","",{"$error":"#N/A"}]
[122,"",{"$f":"IF(Messergebnisse!F15=\"\",\"\",Messergebnisse!F15)","v":""},{"$error":"#N/A"},{"$error":"#N/A"},"","","","","",{"$error":"#N/A"}]
[123,"",{"$f":"IF(Messergebnisse!F16=\"\",\"\",Messergebnisse!F16)","v":""},{"$error":"#N/A"},{"$error":"#N/A"},"","","","","",{"$error":"#N/A"}]
[124,"",{"$f":"IF(Messergebnisse!F17=\"\",\"\",Messergebnisse!F17)","v":""},{"$error":"#N/A"},{"$error":"#N/A"},"","","","","",{"$error":"#N/A"}]
[125,"",{"$f":"IF(Messergebnisse!F18=\"\",\"\",Messergebnisse!F18)","v":""},{"$error":"#N/A"},{"$error":"#N/A"},"","","","","",{"$error":"#N/A"}]
[126,"",{"$f":"IF(Messergebnisse!F19=\"\",\"\",Messergebnisse!F19)","v":""},{"$error":"#N/A"},{"$error":"#N/A"},"","","","","",{"$error":"#N/A"}]
[127,"",{"$f":"IF(Messergebnisse!F20=\"\",\"\",Messergebnisse!F20)","v":""},{"$error":"#N/A"},{"$error":"#N/A"},"","","","","",{"$error":"#N/A"}]
[128,"",{"$f":"IF(Messergebnisse!F21=\"\",\"\",Messergebnisse!F21)","v":""},{"$error":"#N/A"},{"$error":"#N/A"},"","","","","",{"$error":"#N/A"}]
[129,"",{"$f":"IF(Messergebnisse!F22=\"\",\"\",Messergebnisse!F22)","v":""},{"$error":"#N/A"},{"$error":"#N/A"},"","","","",{"$f":"IF(C137=\"\",\"\",(2*F137-1)*(LN(I137)+LN(G137)))","v":""},{"$error":"#N/A"}]
[130,"",{"$f":"IF(Messergebnisse!F23=\"\",\"\",Messergebnisse!F23)","v":""},{"$f":"IF(C138=\"\",#N/A,C138)","v":{"$error":"#N/A"}},{"$f":"IF(C138=\"\",#N/A,SMALL(C$9:C$224,F138))","v":{"$error":"#N/A"}},"",{"$f":"IF(IF(C138=\"\",\"\",NORMSDIST((E138-$E$3)/$E$4))=1,0.999999999,IF(C138=\"\",\"\",NORMSDIST((E138-$E$3)/$E$4)))","v":""},{"$f":"IF(C138=\"\",\"\",1-G138)","v":""},{"$f":"IF(C138=\"\",\"\",SMALL(H$9:H$224,F138))","v":""},"",{"$f":"IF(C138=\"\",#N/A,NORMSINV((F138-0.3)/($E$2+0.4)))","v":{"$error":"#N/A"}}]
[131,"",{"$f":"IF(Messergebnisse!F24=\"\",\"\",Messergebnisse!F24)","v":""},{"$error":"#N/A"},{"$error":"#N/A"},{"$f":"IF(C139=\"\",\"\",F138+1)","v":""},"","","","",{"$error":"#N/A"}]
[132,"",{"$f":"IF(Messergebnisse!F25=\"\",\"\",Messergebnisse!F25)","v":""},{"$error":"#N/A"},{"$error":"#N/A"},"","","","","",{"$error":"#N/A"}]
[133,"",{"$f":"IF(Messergebnisse!F26=\"\",\"\",Messergebnisse!F26)","v":""},{"$error":"#N/A"},{"$error":"#N/A"},"","","","","",{"$error":"#N/A"}]
[134,"",{"$f":"IF(Messergebnisse!F27=\"\",\"\",Messergebnisse!F27)","v":""},{"$error":"#N/A"},{"$error":"#N/A"},"","","","","",{"$error":"#N/A"}]
[135,"",{"$f":"IF(Messergebnisse!F28=\"\",\"\",Messergebnisse!F28)","v":""},{"$error":"#N/A"},{"$error":"#N/A"},"","","","","",{"$error":"#N/A"}]
[136,"",{"$f":"IF(Messergebnisse!F29=\"\",\"\",Messergebnisse!F29)","v":""},{"$error":"#N/A"},{"$error":"#N/A"},"","","","","",{"$error":"#N/A"}]
[137,"",{"$f":"IF(Messergebnisse!F30=\"\",\"\",Messergebnisse!F30)","v":""},{"$error":"#N/A"},{"$error":"#N/A"},"","","","","",{"$error":"#N/A"}]
[138,"",{"$f":"IF(Messergebnisse!F31=\"\",\"\",Messergebnisse!F31)","v":""},{"$error":"#N/A"},{"$error":"#N/A"},"","","","","",{"$error":"#N/A"}]
[139,"",{"$f":"IF(Messergebnisse!F32=\"\",\"\",Messergebnisse!F32)","v":""},{"$error":"#N/A"},{"$error":"#N/A"},"","","","","",{"$error":"#N/A"}]
[140,"",{"$f":"IF(Messergebnisse!F33=\"\",\"\",Messergebnisse!F33)","v":""},{"$error":"#N/A"},{"$error":"#N/A"},"","","","","",{"$error":"#N/A"}]
[141,"",{"$f":"IF(Messergebnisse!F34=\"\",\"\",Messergebnisse!F34)","v":""},{"$error":"#N/A"},{"$error":"#N/A"},"","","","","",{"$error":"#N/A"}]
[142,"",{"$f":"IF(Messergebnisse!F35=\"\",\"\",Messergebnisse!F35)","v":""},{"$error":"#N/A"},{"$error":"#N/A"},"","","","","",{"$error":"#N/A"}]
[143,"",{"$f":"IF(Messergebnisse!F36=\"\",\"\",Messergebnisse!F36)","v":""},{"$error":"#N/A"},{"$error":"#N/A"},"","","","","",{"$error":"#N/A"}]
[144,"",{"$f":"IF(Messergebnisse!F37=\"\",\"\",Messergebnisse!F37)","v":""},{"$error":"#N/A"},{"$error":"#N/A"},"","","","","",{"$error":"#N/A"}]
[145,"",{"$f":"IF(Messergebnisse!F38=\"\",\"\",Messergebnisse!F38)","v":""},{"$error":"#N/A"},{"$error":"#N/A"},"","","","","",{"$error":"#N/A"}]
[146,"",{"$f":"IF(Messergebnisse!F39=\"\",\"\",Messergebnisse!F39)","v":""},{"$error":"#N/A"},{"$error":"#N/A"},"","","","","",{"$error":"#N/A"}]
[147,"",{"$f":"IF(Messergebnisse!F40=\"\",\"\",Messergebnisse!F40)","v":""},{"$error":"#N/A"},{"$error":"#N/A"},"","","","","",{"$error":"#N/A"}]
[148,"",{"$f":"IF(Messergebnisse!F41=\"\",\"\",Messergebnisse!F41)","v":""},{"$error":"#N/A"},{"$error":"#N/A"},"","","","","",{"$error":"#N/A"}]
[149,"",{"$f":"IF(Messergebnisse!F42=\"\",\"\",Messergebnisse!F42)","v":""},{"$error":"#N/A"},{"$error":"#N/A"},"","","","","",{"$error":"#N/A"}]
[150,"",{"$f":"IF(Messergebnisse!F43=\"\",\"\",Messergebnisse!F43)","v":""},{"$error":"#N/A"},{"$error":"#N/A"},"","","","","",{"$error":"#N/A"}]
[151,"",{"$f":"IF(Messergebnisse!F44=\"\",\"\",Messergebnisse!F44)","v":""},{"$error":"#N/A"},{"$error":"#N/A"},"","","","","",{"$error":"#N/A"}]
[152,"",{"$f":"IF(Messergebnisse!F45=\"\",\"\",Messergebnisse!F45)","v":""},{"$error":"#N/A"},{"$error":"#N/A"},"","","","","",{"$error":"#N/A"}]
[153,"",{"$f":"IF(Messergebnisse!F46=\"\",\"\",Messergebnisse!F46)","v":""},{"$error":"#N/A"},{"$error":"#N/A"},"","","","","",{"$error":"#N/A"}]
[154,"",{"$f":"IF(Messergebnisse!F47=\"\",\"\",Messergebnisse!F47)","v":""},{"$error":"#N/A"},{"$error":"#N/A"},"","","","","",{"$error":"#N/A"}]
[155,"",{"$f":"IF(Messergebnisse!F48=\"\",\"\",Messergebnisse!F48)","v":""},{"$error":"#N/A"},{"$error":"#N/A"},"","","","","",{"$error":"#N/A"}]
[156,"",{"$f":"IF(Messergebnisse!F49=\"\",\"\",Messergebnisse!F49)","v":""},{"$error":"#N/A"},{"$error":"#N/A"},"","","","","",{"$error":"#N/A"}]
[157,"",{"$f":"IF(Messergebnisse!F50=\"\",\"\",Messergebnisse!F50)","v":""},{"$error":"#N/A"},{"$error":"#N/A"},"","","","","",{"$error":"#N/A"}]
[158,"",{"$f":"IF(Messergebnisse!F51=\"\",\"\",Messergebnisse!F51)","v":""},{"$error":"#N/A"},{"$error":"#N/A"},"","","","","",{"$error":"#N/A"}]
[159,"",{"$f":"IF(Messergebnisse!F52=\"\",\"\",Messergebnisse!F52)","v":""},{"$error":"#N/A"},{"$error":"#N/A"},"","","","","",{"$error":"#N/A"}]
[160,"",{"$f":"IF(Messergebnisse!F53=\"\",\"\",Messergebnisse!F53)","v":""},{"$error":"#N/A"},{"$error":"#N/A"},"","","","","",{"$error":"#N/A"}]
[161,"",{"$f":"IF(Messergebnisse!F54=\"\",\"\",Messergebnisse!F54)","v":""},{"$error":"#N/A"},{"$error":"#N/A"},"","","","","",{"$error":"#N/A"}]
[162,"",{"$f":"IF(Messergebnisse!F55=\"\",\"\",Messergebnisse!F55)","v":""},{"$error":"#N/A"},{"$error":"#N/A"},"","","","","",{"$error":"#N/A"}]
[163,"",{"$f":"IF(Messergebnisse!H2=\"\",\"\",Messergebnisse!H2)","v":""},{"$error":"#N/A"},{"$error":"#N/A"},"","","","","",{"$error":"#N/A"}]
[164,"",{"$f":"IF(Messergebnisse!H3=\"\",\"\",Messergebnisse!H3)","v":""},{"$error":"#N/A"},{"$error":"#N/A"},"","","","","",{"$error":"#N/A"}]
[165,"",{"$f":"IF(Messergebnisse!H4=\"\",\"\",Messergebnisse!H4)","v":""},{"$error":"#N/A"},{"$error":"#N/A"},"","","","","",{"$error":"#N/A"}]
[166,"",{"$f":"IF(Messergebnisse!H5=\"\",\"\",Messergebnisse!H5)","v":""},{"$error":"#N/A"},{"$error":"#N/A"},"","","","","",{"$error":"#N/A"}]
[167,"",{"$f":"IF(Messergebnisse!H6=\"\",\"\",Messergebnisse!H6)","v":""},{"$error":"#N/A"},{"$error":"#N/A"},"","","","","",{"$error":"#N/A"}]
[168,"",{"$f":"IF(Messergebnisse!H7=\"\",\"\",Messergebnisse!H7)","v":""},{"$error":"#N/A"},{"$error":"#N/A"},"","","","","",{"$error":"#N/A"}]
[169,"",{"$f":"IF(Messergebnisse!H8=\"\",\"\",Messergebnisse!H8)","v":""},{"$error":"#N/A"},{"$error":"#N/A"},"","","","","",{"$error":"#N/A"}]
[170,{"$f":"_xlfn.IFNA(IF(C178=\"\",#N/A,A178),\"\")","v":""},{"$f":"IF(Messergebnisse!H9=\"\",\"\",Messergebnisse!H9)","v":""},{"$error":"#N/A"},{"$error":"#N/A"},"","","","","",{"$error":"#N/A"}]
[171,"",{"$f":"IF(Messergebnisse!H10=\"\",\"\",Messergebnisse!H10)","v":""},{"$error":"#N/A"},{"$error":"#N/A"},"","","","","",{"$error":"#N/A"}]
[172,"",{"$f":"IF(Messergebnisse!H11=\"\",\"\",Messergebnisse!H11)","v":""},{"$error":"#N/A"},{"$error":"#N/A"},"","","","","",{"$error":"#N/A"}]
[173,"",{"$f":"IF(Messergebnisse!H12=\"\",\"\",Messergebnisse!H12)","v":""},{"$error":"#N/A"},{"$error":"#N/A"},"","","","","",{"$error":"#N/A"}]
[174,"",{"$f":"IF(Messergebnisse!H13=\"\",\"\",Messergebnisse!H13)","v":""},{"$error":"#N/A"},{"$error":"#N/A"},"","","","","",{"$error":"#N/A"}]
[175,"",{"$f":"IF(Messergebnisse!H14=\"\",\"\",Messergebnisse!H14)","v":""},{"$error":"#N/A"},{"$error":"#N/A"},"","","","","",{"$error":"#N/A"}]
[176,"",{"$f":"IF(Messergebnisse!H15=\"\",\"\",Messergebnisse!H15)","v":""},{"$error":"#N/A"},{"$error":"#N/A"},"","","","","",{"$error":"#N/A"}]
[177,"",{"$f":"IF(Messergebnisse!H16=\"\",\"\",Messergebnisse!H16)","v":""},{"$error":"#N/A"},{"$error":"#N/A"},"","","","","",{"$error":"#N/A"}]
[178,"",{"$f":"IF(Messergebnisse!H17=\"\",\"\",Messergebnisse!H17)","v":""},{"$error":"#N/A"},{"$error":"#N/A"},"","","","","",{"$error":"#N/A"}]
[179,"",{"$f":"IF(Messergebnisse!H18=\"\",\"\",Messergebnisse!H18)","v":""},{"$error":"#N/A"},{"$error":"#N/A"},"","","","","",{"$error":"#N/A"}]
[180,"",{"$f":"IF(Messergebnisse!H19=\"\",\"\",Messergebnisse!H19)","v":""},{"$error":"#N/A"},{"$error":"#N/A"},"","","","","",{"$error":"#N/A"}]
[181,"",{"$f":"IF(Messergebnisse!H20=\"\",\"\",Messergebnisse!H20)","v":""},{"$error":"#N/A"},{"$error":"#N/A"},"","","","","",{"$error":"#N/A"}]
[182,"",{"$f":"IF(Messergebnisse!H21=\"\",\"\",Messergebnisse!H21)","v":""},{"$error":"#N/A"},{"$error":"#N/A"},"","","","","",{"$error":"#N/A"}]
[183,"",{"$f":"IF(Messergebnisse!H22=\"\",\"\",Messergebnisse!H22)","v":""},{"$error":"#N/A"},{"$error":"#N/A"},"","","","","",{"$error":"#N/A"}]
[184,"",{"$f":"IF(Messergebnisse!H23=\"\",\"\",Messergebnisse!H23)","v":""},{"$error":"#N/A"},{"$error":"#N/A"},"","","","","",{"$error":"#N/A"}]
[185,"",{"$f":"IF(Messergebnisse!H24=\"\",\"\",Messergebnisse!H24)","v":""},{"$error":"#N/A"},{"$error":"#N/A"},"","","","","",{"$error":"#N/A"}]
[186,"",{"$f":"IF(Messergebnisse!H25=\"\",\"\",Messergebnisse!H25)","v":""},{"$error":"#N/A"},{"$error":"#N/A"},"","","","","",{"$error":"#N/A"}]
[187,"",{"$f":"IF(Messergebnisse!H26=\"\",\"\",Messergebnisse!H26)","v":""},{"$error":"#N/A"},{"$error":"#N/A"},"","","","","",{"$error":"#N/A"}]
[188,"",{"$f":"IF(Messergebnisse!H27=\"\",\"\",Messergebnisse!H27)","v":""},{"$error":"#N/A"},{"$error":"#N/A"},"","","","","",{"$error":"#N/A"}]
[189,"",{"$f":"IF(Messergebnisse!H28=\"\",\"\",Messergebnisse!H28)","v":""},{"$error":"#N/A"},{"$error":"#N/A"},"","","","","",{"$error":"#N/A"}]
[190,"",{"$f":"IF(Messergebnisse!H29=\"\",\"\",Messergebnisse!H29)","v":""},{"$error":"#N/A"},{"$error":"#N/A"},"","","","","",{"$error":"#N/A"}]
[191,"",{"$f":"IF(Messergebnisse!H30=\"\",\"\",Messergebnisse!H30)","v":""},{"$error":"#N/A"},{"$error":"#N/A"},"","","","","",{"$error":"#N/A"}]
[192,"",{"$f":"IF(Messergebnisse!H31=\"\",\"\",Messergebnisse!H31)","v":""},{"$error":"#N/A"},{"$error":"#N/A"},"","","","","",{"$error":"#N/A"}]
[193,"",{"$f":"IF(Messergebnisse!H32=\"\",\"\",Messergebnisse!H32)","v":""},{"$error":"#N/A"},{"$error":"#N/A"},"","","","",{"$f":"IF(C201=\"\",\"\",(2*F201-1)*(LN(I201)+LN(G201)))","v":""},{"$error":"#N/A"}]
[194,"",{"$f":"IF(Messergebnisse!H33=\"\",\"\",Messergebnisse!H33)","v":""},{"$f":"IF(C202=\"\",#N/A,C202)","v":{"$error":"#N/A"}},{"$f":"IF(C202=\"\",#N/A,SMALL(C$9:C$224,F202))","v":{"$error":"#N/A"}},"",{"$f":"IF(IF(C202=\"\",\"\",NORMSDIST((E202-$E$3)/$E$4))=1,0.999999999,IF(C202=\"\",\"\",NORMSDIST((E202-$E$3)/$E$4)))","v":""},{"$f":"IF(C202=\"\",\"\",1-G202)","v":""},{"$f":"IF(C202=\"\",\"\",SMALL(H$9:H$224,F202))","v":""},"",{"$f":"IF(C202=\"\",#N/A,NORMSINV((F202-0.3)/($E$2+0.4)))","v":{"$error":"#N/A"}}]
[195,"",{"$f":"IF(Messergebnisse!H34=\"\",\"\",Messergebnisse!H34)","v":""},{"$error":"#N/A"},{"$error":"#N/A"},{"$f":"IF(C203=\"\",\"\",F202+1)","v":""},"","","","",{"$error":"#N/A"}]
[196,"",{"$f":"IF(Messergebnisse!H35=\"\",\"\",Messergebnisse!H35)","v":""},{"$error":"#N/A"},{"$error":"#N/A"},"","","","","",{"$error":"#N/A"}]
[197,"",{"$f":"IF(Messergebnisse!H36=\"\",\"\",Messergebnisse!H36)","v":""},{"$error":"#N/A"},{"$error":"#N/A"},"","","","","",{"$error":"#N/A"}]
[198,"",{"$f":"IF(Messergebnisse!H37=\"\",\"\",Messergebnisse!H37)","v":""},{"$error":"#N/A"},{"$error":"#N/A"},"","","","","",{"$error":"#N/A"}]
[199,"",{"$f":"IF(Messergebnisse!H38=\"\",\"\",Messergebnisse!H38)","v":""},{"$error":"#N/A"},{"$error":"#N/A"},"","","","","",{"$error":"#N/A"}]
[200,"",{"$f":"IF(Messergebnisse!H39=\"\",\"\",Messergebnisse!H39)","v":""},{"$error":"#N/A"},{"$error":"#N/A"},"","","","","",{"$error":"#N/A"}]
[201,"",{"$f":"IF(Messergebnisse!H40=\"\",\"\",Messergebnisse!H40)","v":""},{"$error":"#N/A"},{"$error":"#N/A"},"","","","","",{"$error":"#N/A"}]
[202,"",{"$f":"IF(Messergebnisse!H41=\"\",\"\",Messergebnisse!H41)","v":""},{"$error":"#N/A"},{"$error":"#N/A"},"","","","","",{"$error":"#N/A"}]
[203,"",{"$f":"IF(Messergebnisse!H42=\"\",\"\",Messergebnisse!H42)","v":""},{"$error":"#N/A"},{"$error":"#N/A"},"","","","","",{"$error":"#N/A"}]
[204,"",{"$f":"IF(Messergebnisse!H43=\"\",\"\",Messergebnisse!H43)","v":""},{"$error":"#N/A"},{"$error":"#N/A"},"","","","","",{"$error":"#N/A"}]
[205,"",{"$f":"IF(Messergebnisse!H44=\"\",\"\",Messergebnisse!H44)","v":""},{"$error":"#N/A"},{"$error":"#N/A"},"","","","","",{"$error":"#N/A"}]
[206,"",{"$f":"IF(Messergebnisse!H45=\"\",\"\",Messergebnisse!H45)","v":""},{"$error":"#N/A"},{"$error":"#N/A"},"","","","","",{"$error":"#N/A"}]
[207,"",{"$f":"IF(Messergebnisse!H46=\"\",\"\",Messergebnisse!H46)","v":""},{"$error":"#N/A"},{"$error":"#N/A"},"","","","","",{"$error":"#N/A"}]
[208,"",{"$f":"IF(Messergebnisse!H47=\"\",\"\",Messergebnisse!H47)","v":""},{"$error":"#N/A"},{"$error":"#N/A"},"","","","","",{"$error":"#N/A"}]
[209,"",{"$f":"IF(Messergebnisse!H48=\"\",\"\",Messergebnisse!H48)","v":""},{"$error":"#N/A"},{"$error":"#N/A"},"","","","","",{"$error":"#N/A"}]
[210,"",{"$f":"IF(Messergebnisse!H49=\"\",\"\",Messergebnisse!H49)","v":""},{"$error":"#N/A"},{"$error":"#N/A"},"","","","","",{"$error":"#N/A"}]
[211,"",{"$f":"IF(Messergebnisse!H50=\"\",\"\",Messergebnisse!H50)","v":""},{"$error":"#N/A"},{"$error":"#N/A"},"","","","","",{"$error":"#N/A"}]
[212,"",{"$f":"IF(Messergebnisse!H51=\"\",\"\",Messergebnisse!H51)","v":""},{"$error":"#N/A"},{"$error":"#N/A"},"","","","","",{"$error":"#N/A"}]
[213,"",{"$f":"IF(Messergebnisse!H52=\"\",\"\",Messergebnisse!H52)","v":""},{"$error":"#N/A"},{"$error":"#N/A"},"","","","","",{"$error":"#N/A"}]
[214,"",{"$f":"IF(Messergebnisse!H53=\"\",\"\",Messergebnisse!H53)","v":""},{"$error":"#N/A"},{"$error":"#N/A"},"","","","","",{"$error":"#N/A"}]
[215,"",{"$f":"IF(Messergebnisse!H54=\"\",\"\",Messergebnisse!H54)","v":""},{"$error":"#N/A"},{"$error":"#N/A"},"","","","","",{"$error":"#N/A"}]
[216,"",{"$f":"IF(Messergebnisse!H55=\"\",\"\",Messergebnisse!H55)","v":""},{"$error":"#N/A"},{"$error":"#N/A"},"","","","","",{"$error":"#N/A"}]

{"sheet":"Umstellung","index":4,"n_rows":9,"n_cols":7,"rows_kept":9,"hidden":true}
["Maschinenfähigkeitsindex","Cmk","Cmk<","Cmk>","Cmku","Cmko","Cm"]
["Prozessleistungsindex","Ppk","Ppk<","Ppk>","Ppku","Ppko","Pp"]
["Prozessfähigkeitsindex","Cpk","Cpk<","Cpk>","Cpku","CPko","CP"]
[]
[]
[]
["Maschinenfähigkeitsindex",{"v":1.5,"d":"1.50"},1.33]
["Prozessleistungsindex",1.33,{"v":1,"d":"1.00"}]
["Prozessfähigkeitsindex",1.33,{"v":1,"d":"1.00"}]